{"text_format":"1","workbook":"xlsx","n_sheets":3,"sheets":["Special Rates 2025-26","DATA","Firing Range"],"not_rendered":{"charts":0,"images":1,"macros":1,"external_links":0,"defined_names":57,"comments":0,"pivot_tables":0},"unopened":[],"bounds":{"document_bytes":16777216,"sheet_cells":100000,"rows_first":2000,"rows_last":500,"rows_between":2000,"halvings":0,"cell_chars":16384,"cell_head_chars":4096},"cells_cut":0,"cells_raw":0,"read":"whole","date_system":"1900"}

{"sheet":"Special Rates 2025-26","index":0,"n_rows":141,"n_cols":19,"rows_kept":141,"cut":false,"hidden":false,"merged":[]}
[]
[]
[]
[null,null,null,null,"2025/26 Calculation of Special School Funding Rates"]
[]
[]
[]
[null,"DfE",null,null,{"$f":"IFERROR(VLOOKUP(DFENUM,DATA!B5:C28,2,0),\"\")","v":""}]
[]
[]
[null,"Section 1 - Commissioned Place numbers"]
[]
[null,"Academic Year","Pre-16","Post-16","Weekday Residential","Weekend Residential",null,"High Needs Place numbers as agreed annually with the Local Authority's SEN team\n\n"]
[]
[null,"2024/25",{"$f":"IFERROR(VLOOKUP(DFENUM,DATA!B5:K28,3,0),0)","v":0},{"$f":"IFERROR(VLOOKUP(DFENUM,DATA!B5:K28,5,0),0)","v":0},{"$f":"IFERROR(VLOOKUP(DFENUM,DATA!B5:K28,7,0),0)","v":0},{"$f":"IFERROR(VLOOKUP(DFENUM,DATA!B5:K28,9,0),0)","v":0},null,"Place numbers 2024-25 agreed November 2023"]
[]
[null,"2025/26",{"$f":"IFERROR(VLOOKUP(DFENUM,DATA!B5:K28,4,0),0)","v":0},{"$f":"IFERROR(VLOOKUP(DFENUM,DATA!B5:K28,6,0),0)","v":0},{"$f":"IFERROR(VLOOKUP(DFENUM,DATA!B5:K28,8,0),0)","v":0},{"$f":"IFERROR(VLOOKUP(DFENUM,DATA!B5:K28,10,0),0)","v":0},null,"Place numbers 2025-26 agreed November 2024"]
[]
[null,"Movement",{"$f":"C17-C15","v":0},{"$f":"D17-D15","v":0},{"$f":"E17-E15","v":0},{"$f":"F17-F15","v":0}]
[]
{"$rows_left_out":122}
{"sheet":"DATA","index":1,"n_rows":28,"n_cols":85,"rows_kept":28,"cut":false,"hidden":true,"merged":[[2,29,2,36],[2,14,2,16],[2,17,2,19],[2,20,2,22],[1,11,1,25],[2,23,2,25],[2,11,2,13],[1,3,1,10],[2,3,2,4],[2,5,2,6],[2,7,2,8],[2,9,2,10],[2,58,2,59],[2,60,2,61],[1,47,1,55],[2,47,2,49],[2,50,2,52],[2,53,2,55],[2,56,2,57],[1,63,1,73],[2,63,2,67],[2,69,2,73],[1,74,1,84],[2,74,2,78],[2,80,2,84]]}
[null,1,2,3,4,5,6,7,8,9,10,11,12,13,14,15,16,17,18,19,20,21,22,23,24,25,26,27,28,29,30,31,32,33,34,35,36,37,38,39,40,41,42,43,44,45,46,47,48,49,50,51,52,53,54,55,56,57,58,59,60,61,62,63,64,65,66,67,68,69,70,71,72,73,74,75,76,77,78,79,80,81,82,83,84]
[null,null,null,"Places",null,null,null,null,null,null,null,"Rates",null,null,null,null,null,null,null,null,null,null,null,null,null,null,null,null,null,null,null,null,null,null,null,null,null,null,null,null,null,null,null,null,null,null,null,"Residential Rates",null,null,null,null,null,null,null,null,null,null,null,null,null,null,null,"2024/25 Financial Year",null,null,null,null,null,null,null,null,null,null,"2025/26 Financial Year"]
[null,null,null,"Pre-16",null,"Post-16",null,"Weekday",null,"Weekend",null,"MLD & SLCN",null,null,"ASD",null,null,"SEMH",null,null,"SLD",null,null,"PD & PMLD",null,null,null,null,null,"London Fringe",null,null,null,null,null,null,null,null,null,null,null,null,null,null,null,null,null,"ASD Weekday",null,null,"PD Weekday",null,null,"PD Weekend",null,null,"Residential Winter Rates",null,"Residential Pupil Fringe",null,"Residential School Fringe",null,null,"Pupil Led",null,null,null,null,"School","MFG",null,null,null,null,"Pupil Led",null,null,null,null,"School","MFG"]
[null,"DFE","School","24/25","25/26","24/25","25/26","24/25","25/26","24/25","25/26","Summer","Winter","Old Financial Year","Summer","Winter","Old Financial Year","Summer","Winter","Old Financial Year","Summer","Winter","Old Financial Year","Summer","Winter","Old Financial Year",null,"ASD Rate","SEMH Rate","MLD & SLCN","SEMH","SLD","PD & PMLD","ASD","Residential weekdayASD","Residential weekdayPD & PMLD","Residential WeekendPD & PMLD","Gross Day Floor Area","Residential floor area weekday","Residential floor area weekend","Grounds site area","Rentals","Hydrotherapy Pool","No of FSM","London Fringe","Split  site- Band  1","Split site - Band 2","Summer","Last Financial Year","Winter","Summer","Last Financial Year","Winter","Summer","Last Financial Year","Winter","Weekday","Weekend","Weekday","Weekend","Weekday","Weekend","Nursery FTE","MLD&SLCN","SEMH","SLD","PD&PMLD","ASD","All","MLD&SLCN","SEMH","SLD","PD&PMLD","ASD","MLD&SLCN","SEMH","SLD","PD&PMLD","ASD","All","MLD&SLCN","SEMH","SLD","PD&PMLD","ASD"]
[null,7002,"Broomhill Bank School",280,300,113,118,23,23,0,0,13071.542794374931,12939.238423117131,15040.548599999998,20682.016801528142,20549.712430270345,21267.8904,19829.626638783873,19697.322267526077,19628.929738620933,17577.120121272812,17444.815750015012,18719.039549999998,25085.608916901449,24953.304545643652,24853.549499999997,null,17842.640536267416,17020.592272905844,46.798972216541436,63.088135592461505,73.334208159428314,117.52723663053089,93.430034975157739,0,0,0,12163,632.10699851023674,0,10.685,0,0,0.34353741496598639,1,0,1,61330.602779768742,61880.643899999995,61198.298408510949,0,0,0,0,0,0,28329.083330820737,0,1018.5017506447305,0,10.677761456215279,0,0,10512.107017994396,17203.279141171573,14973.074668388337,22407.221990792932,18047.229797354019,2425.6505974493575,2102.7909845562426,0,1320.3142841623012,20.676911757705966,795.01000519662193,10617.228088174343,17375.311932583285,15122.805415072222,22631.29421070086,18227.702095327553,2377.1371563002067,2046.1833555254489,0,1219.0969786275673,0,663.05114837224028]
[null,7005,"Aspire School",174,189,0,0,0,0,0,0,13809.653105711488,13566.546415653502,13681.503085462284,21373.496050106081,21130.389360048099,21170.45649575397,20551.447786744509,20308.341096686527,20356.547324108848,18288.695196666482,18045.588506608496,18116.198225021682,25752.990963824013,25509.884273766031,25506.59007369251,null,17842.640536267416,17020.592272905844,0,0,0,0,0,0,0,0,3227,0,0,1.7432000000000001,0,0,0.38505747126436779,0,0,0,0,0,0,0,0,0,0,0,0,0,0,0,0,0,0,0,10465.771401938415,17140.81564058498,14900.466541497815,22290.858390168643,17954.724812230099,3215.7316835238676,0,0,0,0,0,10570.429115957799,17312.223796990824,15049.471206912795,22513.766974070328,18134.272060352399,3097.4117538865303,13.662215617952825,0,0,0,0]
[null,7006,"Snowfields Academy",276,312,48,36,0,0,0,0,13004.267848247171,12852.726008344394,13997.248049999998,20568.110792641768,20416.568952738991,21376.068599999999,19746.062529280196,19594.520689377419,20574.128849999997,17483.309939202165,17331.768099299388,18366.726749999998,24947.6057063597,24796.063866456923,25648.444199999998,null,17842.640536267416,17020.592272905844,0,0,0,0,0,0,0,0,7642,0,0,7.3,0,0,0.34859154929577463,0,0,1,0,0,0,0,0,0,0,0,0,0,0,0,0,0,0,0,10465.771401938415,17140.81564058498,14900.466541497815,22290.858390168643,17954.724812230099,2693.6665985064374,837.81004955514618,739.64661090858135,772.5936099957471,663.91921132491552,727.6771892634606,10570.429115957799,17312.223796990824,15049.471206912795,22513.766974070328,18134.272060352399,2345.4393256794192,1081.3796083627785,916.46572732975255,971.81621740778428,789.23790025024937,896.35721396818553]
[null,7021,"Valence School",85,85,30,30,46,46,18,18,17475.609925933568,17486.365310369474,17412.638927111417,24355.062286123131,24365.817670559045,24223.977897596145,24270.833062839607,24281.588447275521,24140.582627018397,22041.687590781228,22052.442975217138,21933.507902208112,29650.936491323977,29661.691875759891,29467.417704725689,null,17020.592272905844,17020.592272905844,178.96900403643997,232.39745990945855,266.00457792910902,410.95771131432406,316.62668319298382,0,0,0,8799,0,1924,18.321999999999999,0,1,0.35164835164835168,1,0,0,0,0,0,82902.824839677778,82120.974564914941,82913.580224113684,111639.07020978507,110527.95390657456,111649.82559422098,43508.32725496593,27388.918428810259,1317.1830268877998,1865.4751470908054,38.811341640852056,38.811341640852056,0,10642.96843563786,17370.912135544837,15163.837410734555,22697.747213252136,17454.307406122585,6769.6704914735565,0,0,0,0,0,10749.398119994239,17544.621256900282,15315.475784841903,22924.724685384652,17628.850480183806,6732.4857801936078,0,0,0,0,0]
[null,7032,"Bower Grove School",225,225,0,0,0,0,0,0,13420.80353282038,13431.625079291181,13275.173040559817,20162.598213853409,20173.419760324206,19950.217279206379,20162.598213853409,20173.419760324206,19950.217279206379,17899.845623775374,17910.667170246175,17709.868180119214,25364.141390932913,25374.96293740371,25100.260028790046,null,17020.592272905844,17020.592272905844,0,0,0,0,0,0,0,0,4185.3,0,0,2.1496,0,0,0.68085106382978722,0,1,0,0,0,0,0,0,0,0,0,0,0,0,0,0,0,0,0,10465.771401938415,17140.81564058498,14900.466541497815,22290.858390168643,17140.81564058498,2809.4016386214003,0,0,0,0,0,10570.429115957799,17312.223796990824,15049.471206912795,22513.766974070328,17312.223796990824,2856.6869856372159,0,0,0,0,0]
[null,7033,"St Anthony's School",98,98,0,0,0,0,0,0,16476.37243457327,16471.002345955887,16140.414602042965,23218.167115606295,23212.797026988912,22815.458840689527,23218.167115606295,23212.797026988912,22815.458840689527,20955.414525528264,20950.044436910881,20575.109741602362,28419.710292685799,28414.340204068416,27965.50159027319,null,17020.592272905844,17020.592272905844,0,0,0,0,0,0,0,0,3614,0,0,1.54,0,0,0.71698113207547165,0,0,0,0,0,0,0,0,0,0,0,0,0,0,0,0,0,0,0,10465.771401938415,17140.81564058498,14900.466541497815,22290.858390168643,17140.81564058498,5674.6432001045487,0,0,0,0,0,10570.429115957799,17312.223796990824,15049.471206912795,22513.766974070328,17312.223796990824,5902.8107669219971,0,0,0,0,0]
[null,7039,"The Ifield School",221,211,45,55,0,0,0,0,13271.018626247202,13264.41030528651,13128.51832958902,20834.861570641799,20828.253249681111,20617.471739880704,20012.813307280227,20006.204986319539,19803.562568235582,17750.060717202196,17743.452396241504,17563.213469148417,25214.356484359731,25207.748163399043,24953.605317819249,null,17842.640536267416,17020.592272905844,0,0,0,0,0,0,0,0,4274.1399960000008,0,0,6.22,75000,1,0.45070422535211274,0,1,0,0,0,0,0,0,0,0,0,0,0,0,0,0,0,0,6,10465.771401938415,17140.81564058498,14900.466541497815,22290.858390168643,17954.724812230099,2662.7469276506049,0,0,0,0,0,10570.429115957799,17312.223796990824,15049.471206912795,22513.766974070328,18134.272060352399,2696.7346563956667,0,0,0,0,0]
[null,7040,"Foreland Fields School",210,210,34,32,0,0,0,0,13630.751761320747,13668.263401186525,13386.143798752735,21194.594705715346,21232.106345581124,20875.097209044419,20372.546442353774,20410.058082219552,20061.188037399297,18109.793852275743,18147.305492141517,17820.838938312132,25574.089619433278,25611.601259299056,25211.23078698296,null,17842.640536267416,17020.592272905844,0,0,0,0,0,0,0,0,4705.83,0,0,4.4852999999999996,89330,1,0.50222222222222224,0,2,0,0,0,0,0,0,0,0,0,0,0,0,0,0,0,0,10,10465.771401938415,17140.81564058498,14900.466541497815,22290.858390168643,17954.724812230099,2920.3723968143186,0,0,0,0,0,10570.429115957799,17312.223796990824,15049.471206912795,22513.766974070328,18134.272060352399,3082.2044352846528,0,0,0,0,0]
[null,7041,"Goldwyn School",160,160,35,35,0,0,0,0,15365.476175796584,15378.964473736045,14810.860776480236,22107.270856829608,22120.759154769068,21485.905015126798,22107.270856829608,22120.759154769068,21485.905015126798,19844.518266751576,19858.006564691037,19245.555916039637,27308.814033909111,27322.302331848572,26635.947764710465,null,17020.592272905844,17020.592272905844,0,0,0,0,0,0,0,0,6370.1000899999999,0,0,7.8662000000000001,47900,0,0.51875000000000004,0,3,4,0,0,0,0,0,0,0,0,0,0,0,0,0,0,0,0,10465.771401938415,17140.81564058498,14900.466541497815,22290.858390168643,17140.81564058498,4345.0893745418207,0,0,0,0,0,10570.429115957799,17312.223796990824,15049.471206912795,22513.766974070328,17312.223796990824,4802.9152336368043,0,0,0,0,0]
[null,7043,"The Beacon Folkestone",324,373,84,75,0,0,0,0,12860.294501903481,12679.432853063983,12674.340408994773,20424.137446298078,20243.27579745858,20163.293819286453,19602.089182936506,19421.227534097008,19349.384647641331,17339.336592858475,17158.474944018977,17109.03554855417,24803.63236001601,24622.770711176512,24499.427397225001,null,17842.640536267416,17020.592272905844,0,0,0,0,0,0,0,0,10148,0,0,5.4561000000000002,0,1,0.54941860465116277,0,0,1,0,0,0,0,0,0,0,0,0,0,0,0,0,0,0,10,10465.771401938415,17140.81564058498,14900.466541497815,22290.858390168643,17954.724812230099,2208.5690070563551,0,0,0,0,0,10570.429115957799,17312.223796990824,15049.471206912795,22513.766974070328,18134.272060352399,2184.3627574559746,0,0,0,0,0]
[null,7044,"Rowhill School",150,150,0,0,0,0,0,0,14826.748899210346,14830.924661116713,15047.040899999998,21706.201259399917,21710.377021306285,21702.347182831363,21630.66961895545,21634.845380861818,21627.563380411098,19392.82656405801,19397.002325964379,19415.966850000001,27002.075464600759,27006.251226507127,26945.786989960914,null,17020.592272905844,17020.592272905844,178.96900403644054,241.09504274851753,266.00457792910953,410.95771131432451,316.62668319298456,0,0,0,4165,0,0,1.8948,0,0,0.60624999999999996,1,0,0,0,0,0,0,0,0,0,0,0,0,0,0,0,0,0,0,10642.96843563786,17379.523603702321,15163.837410734555,22697.747213252136,17454.307406122585,4248.0397767087761,156.03268765336179,0,4.0896625566711009,0,0,10749.398119994239,17553.318839739342,15315.475784841903,22924.724685384652,17628.85048018381,4079.786640328155,217.85613967760401,0,20.704424829938944,0,0]
[null,7045,"Elms School",152,152,0,0,0,0,0,0,14363.266643934878,14345.550211958107,14216.537630653023,21105.061324967905,21087.344892991132,20891.581869299589,21105.061324967905,21087.344892991132,20891.581869299589,18842.308734889873,18824.592302913101,18651.232770212424,26306.604502047408,26288.888070070636,26041.624618883252,null,17020.592272905844,17020.592272905844,0,0,0,0,0,0,0,0,2771,0,0,2.13,0,0,0.79259259259259263,0,0,0,0,0,0,0,0,0,0,0,0,0,0,0,0,0,0,0,10465.771401938415,17140.81564058498,14900.466541497815,22290.858390168643,17140.81564058498,3750.7662287146095,0,0,0,0,0,10570.429115957799,17312.223796990824,15049.471206912795,22513.766974070328,17312.223796990824,3782.5029426572964,0,0,0,0,0]
[null,7051,"Nexus School",256,274,39,54,0,0,0,0,13184.753485916423,12947.331607964954,13222.05135,20748.59643031102,20511.174552359549,20552.42767078169,19926.548166949447,19689.126288997977,19738.518499136568,17663.795576871416,17426.373698919946,17498.169400049403,25128.091344028951,24890.669466077481,24888.561248720234,null,17842.640536267416,17020.592272905844,0,0,0,0,0,0,0,0,7075.8,0,0,2.36,0,1,0.40336134453781514,0,0,1,0,0,0,0,0,0,0,0,0,0,0,0,0,0,0,8,10465.771401938415,17140.81564058498,14900.466541497815,22290.858390168643,17954.724812230099,2597.7028585515873,158.57708950999768,0,0,0,0,10570.429115957799,17312.223796990824,15049.471206912795,22513.766974070328,18134.272060352399,2475.8282744869348,175.79395955526525,0,0,0,0]
[null,7052,"Grange Park School",136,136,75,64,0,0,0,0,13181.623267132103,13322.081354849102,13643.829749999999,20745.466211526698,20885.924299243696,21022.650299999994,19923.417948165126,20063.876035882124,20220.71055,17660.665358087099,17801.123445804096,18013.308449999997,25124.96112524463,25265.419212961628,25295.025899999997,null,17842.640536267416,17020.592272905844,0,0,0,0,0,0,0,0,2589.33,0,0,1.2464999999999999,0,0,0.38211382113821135,0,1,0,0,0,0,0,0,0,0,0,0,0,0,0,0,0,0,0,10465.771401938415,17140.81564058498,14900.466541497815,22290.858390168643,17954.724812230099,2953.6178360836266,224.4405119779567,126.27707333139551,159.22407241855399,50.549673747726047,114.30765168626385,10570.429115957799,17312.223796990824,15049.471206912795,22513.766974070328,18134.272060352399,2693.1280356758862,380.2725983663131,215.35871733328895,270.70920741131704,88.130890253782127,195.25020397171465]
[null,7056,"Five Acre Wood School",728,690,110,122,0,0,0,0,11795.846299796947,11834.343370858627,11727.697212263953,19359.689244191541,19398.186315253224,19216.650622555637,18537.640980829969,18576.138051891652,18402.741450910515,16274.888390751941,16313.385461813621,16162.39235182335,23739.184157909473,23777.681228971156,23552.784200494181,null,17842.640536267416,17020.592272905844,0,0,0,0,0,0,0,0,11119.17,0,0,2.6381999999999999,9259,1,0.39750692520775621,0,1,1,0,0,0,0,0,0,0,0,0,0,0,0,0,0,0,15,10465.771401938415,17140.81564058498,14900.466541497815,22290.858390168643,17954.724812230099,1261.9258103255365,0,0,0,0,0,10570.429115957799,17312.223796990824,15049.471206912795,22513.766974070328,18134.272060352399,1247.873808625128,0,0,0,0,0]
[null,7058,"Stone Bay School",95,84,8,19,10,10,0,0,15782.694806548876,15781.743957921513,17117.662499999999,30744.972121197621,30744.021272570255,30600.983699999997,22524.489487581901,22523.538638954535,22449.760349999997,20261.73689750387,20260.786048876507,21121.461899999995,27726.032664661405,27725.081816034039,27794.420699999995,null,25241.074906521564,17020.592272905844,0,0,0,0,0,0,0,0,2396.216342490492,1481.783657509508,0,0.96,0,1,0.59595959595959591,0,0,0,94440.112904895388,93440.615877175529,94439.162056268018,91421.173448359172,90451.566910308,91420.222599731802,0,0,0,34615.65752332245,0,0,0,0,0,0,10465.771401938415,17140.81564058498,14900.466541497815,22290.858390168643,25279.907357036187,5152.7686818922484,1499.1224161693335,156.17602752277162,1068.2266766099347,350.79362793909968,168.3076610715616,10570.429115957799,17312.223796990824,15049.471206912795,22513.766974070328,25532.706430606544,5211.711028891782,1335.5223551504168,0,860.27966419541917,68.9426970378845,0]
{"$rows_left_out":9}
{"sheet":"Firing Range","index":2,"n_rows":54,"n_cols":50,"rows_kept":54,"cut":false,"hidden":true,"merged":[]}
[{"$f":"COUNTIF(B1:AT1,\">0\")-22","v":1},null,7032,{"$f":"COUNTIF(D2:D108,\">0\")","v":0},7033,{"$f":"COUNTIF(F2:F108,\">0\")","v":0},7044,{"$f":"COUNTIF(H2:H108,\">0\")","v":0},7045,{"$f":"COUNTIF(J2:J108,\">0\")","v":0},7062,{"$f":"COUNTIF(L2:L108,\">0\")","v":0},7041,{"$f":"COUNTIF(N2:N108,\">0\")","v":0},7067,{"$f":"COUNTIF(P2:P108,\">0\")","v":0},7021,{"$f":"COUNTIF(R2:R108,\">0\")","v":0},7002,{"$f":"COUNTIF(T2:T108,\">0\")","v":0},7052,{"$f":"COUNTIF(V2:V108,\">0\")","v":0},7058,{"$f":"COUNTIF(X2:X108,\">0\")","v":0},7073,{"$f":"COUNTIF(Z2:Z108,\">0\")","v":0},7039,{"$f":"COUNTIF(AB2:AB108,\">0\")","v":0},7040,{"$f":"COUNTIF(AD2:AD108,\">0\")","v":0},7043,{"$f":"COUNTIF(AF2:AF108,\">0\")","v":0},7051,{"$f":"COUNTIF(AH2:AH108,\">0\")","v":1},7056,{"$f":"COUNTIF(AJ2:AJ108,\">0\")","v":0},7063,{"$f":"COUNTIF(AL2:AL108,\">0\")","v":0},7066,{"$f":"COUNTIF(AN2:AN108,\">0\")","v":0},7069,{"$f":"COUNTIF(AP2:AP108,\">0\")","v":0},7070,{"$f":"COUNTIF(AR2:AR108,\">0\")","v":0},7072,{"$f":"COUNTIF(AT2:AT108,\">0\")","v":0},7005,{"$f":"COUNTIF(AV2:AV108,\">0\")","v":0},7006,{"$f":"COUNTIF(AX2:AX108,\">0\")","v":0}]
["DFENUM",{"$f":"'Special Rates 2025-26'!DFENUM","v":0},7032,{"$f":"IF(C2=C1,0,1)","v":0},7033,{"$f":"IF(E2=E1,0,1)","v":0},7044,{"$f":"IF(G2=G1,0,1)","v":0},7045,{"$f":"IF(I2=I1,0,1)","v":0},7062,{"$f":"IF(K2=K1,0,1)","v":0},7041,{"$f":"IF(M2=M1,0,1)","v":0},7067,{"$f":"IF(O2=O1,0,1)","v":0},7021,{"$f":"IF(Q2=Q1,0,1)","v":0},7002,{"$f":"IF(S2=S1,0,1)","v":0},7052,{"$f":"IF(U2=U1,0,1)","v":0},7058,{"$f":"IF(W2=W1,0,1)","v":0},7073,{"$f":"IF(Y2=Y1,0,1)","v":0},7039,{"$f":"IF(AA2=AA1,0,1)","v":0},7040,{"$f":"IF(AC2=AC1,0,1)","v":0},7043,{"$f":"IF(AE2=AE1,0,1)","v":0},7051,{"$f":"IF(AG2=AG1,0,1)","v":0},7056,{"$f":"IF(AI2=AI1,0,1)","v":0},7063,{"$f":"IF(AK2=AK1,0,1)","v":0},7066,{"$f":"IF(AM2=AM1,0,1)","v":0},7069,{"$f":"IF(AO2=AO1,0,1)","v":0},7070,{"$f":"IF(AQ2=AQ1,0,1)","v":0},7072,{"$f":"IF(AS2=AS1,0,1)","v":0},7005,{"$f":"IF(AU2=AU1,0,1)","v":0},7006,{"$f":"IF(AW2=AW1,0,1)","v":0}]
["NAME",{"$f":"[0]!NAME","v":""},"Bower Grove School",0,"St Anthony's School",0,"Rowhill School",0,"Elms School",0,"The Orchard School",0,"Goldwyn School",0,"Portal House School",0,"Valence School",0,"Broomhill Bank School",0,"Grange Park School",0,"Stone Bay School",0,"Laleham Gap School",0,"The Ifield School",0,"Foreland Fields School",0,"The Beacon Folkestone",0,"Nexus School",0,"Five Acre Wood School",0,"St Nicholas' School",0,"Milestone Academy",0,"The Wyvern School",0,"Oakley School",0,"Meadowfield School",0,"Aspire School",0,"Snowfields Academy",0]
["preold",{"$f":"[0]!preold","v":0},225,0,98,0,150,0,152,0,100,0,160,0,80,0,85,0,280,0,136,0,95,0,193,0,221,0,210,0,324,0,256,1,728,0,297,0,288,0,308,0,182,0,326,0,174,0,276,0]
["postold",{"$f":"[0]!postold","v":0},0,0,0,0,0,0,0,0,0,0,35,0,0,0,30,0,113,0,75,0,8,0,14,0,45,0,34,0,84,0,39,0,110,0,43,0,75,0,44,0,30,0,63,0,0,0,48,0]
["weekdayold",{"$f":"[0]!weekdayold","v":0},0,0,0,0,0,0,0,0,0,0,0,0,0,0,46,0,23,0,0,0,10,0,0,0,0,0,0,0,0,0,0,0,0,0,0,0,0,0,0,0,0,0,0,0,0,0,0,0]
["weekendold",{"$f":"[0]!weekendold","v":0},0,0,0,0,0,0,0,0,0,0,0,0,0,0,18,0,0,0,0,0,0,0,0,0,0,0,0,0,0,0,0,0,0,0,0,0,0,0,0,0,0,0,0,0,0,0,0,0]
["prenew",{"$f":"[0]!prenew","v":0},225,0,98,0,150,0,152,0,100,0,160,0,80,0,85,0,300,0,136,0,84,0,193,0,211,0,210,0,373,0,274,0,690,0,304,0,283,0,302,0,171,0,328,0,189,0,312,0]
["postnew",{"$f":"[0]!postnew","v":0},0,0,0,0,0,0,0,0,0,0,35,0,0,0,30,0,118,0,64,0,19,0,14,0,55,0,32,0,75,0,54,0,122,0,56,0,80,0,58,0,40,0,62,0,0,0,36,0]
["weekdaynew",{"$f":"[0]!weekdaynew","v":0},0,0,0,0,0,0,0,0,0,0,0,0,0,0,46,0,23,0,0,0,10,0,0,0,0,0,0,0,0,0,0,0,0,0,0,0,0,0,0,0,0,0,0,0,0,0,0,0]
["weekendnew",{"$f":"[0]!weekendnew","v":0},0,0,0,0,0,0,0,0,0,0,0,0,0,0,18,0,0,0,0,0,0,0,0,0,0,0,0,0,0,0,0,0,0,0,0,0,0,0,0,0,0,0,0,0,0,0,0,0]
["mldold",{"$f":"[0]!mldold","v":0},13420.80353282038,0,16476.37243457327,0,14826.748899210346,0,14363.266643934878,0,15966.406209064064,0,15365.476175796584,0,17752.632856434757,0,17475.609925933568,0,13071.542794374931,0,13181.623267132103,0,15782.694806548876,0,13534.492702768724,0,13271.018626247202,0,13630.751761320747,0,12860.294501903481,0,13184.753485916423,0,11795.846299796947,0,13328.832256073123,0,13154.468081335277,0,12631.471487487115,0,13700.995084504832,0,12746.444760215796,0,13809.653105711488,0,13004.267848247171,0]
["besdold",{"$f":"[0]!besdold","v":0},20162.598213853409,0,23218.167115606295,0,21630.66961895545,0,21105.061324967905,0,22708.200890097087,0,22107.270856829608,0,24494.427537467782,0,24270.833062839607,0,19829.626638783873,0,19923.417948165126,0,22524.489487581901,0,20276.287383801751,0,20012.813307280227,0,20372.546442353774,0,19602.089182936506,0,19926.548166949447,0,18537.640980829969,0,20070.62693710615,0,19949.691218241322,0,19373.266168520138,0,20442.789765537858,0,19488.239441248817,0,20551.447786744509,0,19746.062529280196,0]
["sldold",{"$f":"[0]!sldold","v":0},17899.845623775374,0,20955.414525528264,0,19392.82656405801,0,18842.308734889873,0,20445.448300019059,0,19844.518266751576,0,22231.674947389751,0,22041.687590781228,0,17577.120121272812,0,17660.665358087099,0,20261.73689750387,0,18013.53479372372,0,17750.060717202196,0,18109.793852275743,0,17339.336592858475,0,17663.795576871416,0,16274.888390751941,0,17807.874347028115,0,17720.545746182943,0,17110.513578442107,0,18180.037175459827,0,17225.48685117079,0,18288.695196666482,0,17483.309939202165,0]
["pdold",{"$f":"[0]!pdold","v":0},25364.141390932913,0,28419.710292685799,0,27002.075464600759,0,26306.604502047408,0,27909.744067176591,0,27308.814033909111,0,29695.970714547286,0,29650.936491323977,0,25085.608916901449,0,25124.96112524463,0,27726.032664661405,0,25477.830560881255,0,25214.356484359731,0,25574.089619433278,0,24803.63236001601,0,25128.091344028951,0,23739.184157909473,0,25272.170114185654,0,25329.794646725692,0,24574.809345599642,0,25644.332942617362,0,24689.782618328321,0,25752.990963824013,0,24947.6057063597,0]
["asdold",{"$f":"[0]!asdold","v":0},20162.598213853409,0,23218.167115606295,0,21706.201259399917,0,21105.061324967905,0,22708.200890097087,0,22107.270856829608,0,24494.427537467782,0,24355.062286123131,0,20682.016801528142,0,20745.466211526698,0,30744.972121197621,0,21098.335647163323,0,20834.861570641799,0,21194.594705715346,0,20424.137446298078,0,20748.59643031102,0,19359.689244191541,0,20892.675200467722,0,20871.260911578138,0,20195.31443188171,0,21264.83802889943,0,20310.287704610389,0,21373.496050106081,0,20568.110792641768,0]
["pdweekdayold",{"$f":"[0]!pdweekdayold","v":0},0,0,0,0,0,0,0,0,0,0,0,0,0,0,82902.824839677778,0,0,0,0,0,91421.173448359172,0,0,0,0,0,0,0,0,0,0,0,0,0,0,0,0,0,0,0,0,0,0,0,0,0,0,0]
["asdweekdayold",{"$f":"[0]!asdweekdayold","v":0},0,0,0,0,0,0,0,0,0,0,0,0,0,0,0,0,61330.602779768742,0,0,0,94440.112904895388,0,0,0,0,0,0,0,0,0,0,0,0,0,0,0,0,0,0,0,0,0,0,0,0,0,0,0]
["pdweekendold",{"$f":"[0]!pdweekendold","v":0},0,0,0,0,0,0,0,0,0,0,0,0,0,0,111639.07020978507,0,0,0,0,0,0,0,0,0,0,0,0,0,0,0,0,0,0,0,0,0,0,0,0,0,0,0,0,0,0,0,0,0]
["mldnew",{"$f":"[0]!mldnew","v":0},13431.625079291181,0,16471.002345955887,0,14830.924661116713,0,14345.550211958107,0,15979.694895477607,0,15378.964473736045,0,17751.879892997018,0,17486.365310369474,0,12939.238423117131,0,13322.081354849102,0,15781.743957921513,0,13602.935604323888,0,13264.41030528651,0,13668.263401186525,0,12679.432853063983,0,12947.331607964954,0,11834.343370858627,0,13214.654052133419,0,13165.831837122896,0,12602.534138473178,0,13747.344311469942,0,12762.672904985002,0,13566.546415653502,0,12852.726008344394,0]
{"$rows_left_out":34}