{"text_format":"1","workbook":"xlsx","n_sheets":4,"sheets":["Introduction","Benchmarking","2023-24 Data","PFI Adjustments"],"not_rendered":{"charts":0,"images":2,"macros":1,"external_links":0,"defined_names":6,"comments":0,"pivot_tables":0},"unopened":[],"bounds":{"document_bytes":16777216,"sheet_cells":100000,"rows_first":2000,"rows_last":500,"rows_between":2000,"halvings":0,"cell_chars":16384,"cell_head_chars":4096},"cells_cut":0,"cells_raw":0,"read":"whole","date_system":"1900"}

{"sheet":"Introduction","index":0,"n_rows":22,"n_cols":5,"rows_kept":22,"cut":false,"hidden":false,"merged":[[6,4,9,4],[13,4,15,4],[16,4,17,4]]}
[]
[]
[null,{"$f":"Benchmarking!C1&\" Data\"","v":"2023-24 Data"},null,null,{"$f":"\"Kent LA Schools' Benchmarking Data \"&Benchmarking!C1","v":"Kent LA Schools' Benchmarking Data 2023-24"}]
[]
[null,null,null,null,"THIS BENCHMARKING SHEET IS FOR PRIMARY SCHOOLS ONLY"]
[]
[null,null,null,null,{"$f":"\"The Benchmarking spreadsheet shows the income and expenditure information for the \"&Benchmarking!C1&\" financial year at subjective account level i.e. CFR codes. It shows all revenue income and expenditure including standards funds. Capital income and expenditure is excluded.\"","v":"The Benchmarking spreadsheet shows the income and expenditure information for the 2023-24 financial year at subjective account level i.e. CFR codes. It shows all revenue income and expenditure including standards funds. Capital income and expenditure is excluded."}]
[]
[]
[]
[]
[null,null,null,null,"Enter your DFE number in the pink shaded box.  "]
[]
[null,null,null,null,"Select Schools with or without Nursery places, School type and Pupil options from the drop down boxes.  "]
[]
{"$rows_left_out":8}
{"sheet":"Benchmarking","index":1,"n_rows":75,"n_cols":15,"rows_kept":75,"cut":false,"hidden":false,"merged":[[8,13,8,14],[7,8,7,10],[9,12,10,14],[9,4,9,5],[10,4,10,5],[10,8,10,10],[4,8,4,10],[9,8,9,10],[5,1,6,5],[2,8,2,10],[6,8,6,10],[3,8,3,10],[5,8,5,10]]}
[null,"Subjective Analysis of ","2023-24"," Income and Expenditure Compared to selected and Kent Primary Averages"]
[]
[null,null,null,null,null,"Nursery","R to Yr 6",null,"Benchmark against schools with Nursery's"]
[null,null,"Enter last 4 digits of your DfE No.",null,"Pupil Roll",{"$f":"IF(ISERROR(VLOOKUP(D4,'2023-24 Data'!A3:C254,3,0)),\"\",VLOOKUP(D4,'2023-24 Data'!A3:C254,3,0))","v":""},{"$f":"IF(ISERROR(VLOOKUP(D4,'2023-24 Data'!A3:D254,4,0)),\"\",VLOOKUP(D4,'2023-24 Data'!A3:D254,4,0))","v":""}]
[null,null,null,null,null,null,null,null,"Select type of School"]
[null,{"$f":"B1&C1&D1","v":"Subjective Analysis of 2023-24 Income and Expenditure Compared to selected and Kent Primary Averages"}]
[null,null,null,null,null,null,null,null,"Select Pupil Roll to Benchmark against"]
[]
[null,null,null,null,null,null,null,null,null,null,null,null,null,{"$f":"IF(I6=\"\",\"\",IF(I4=I6,\"you have already selected this school\",\"\"))","v":""}]
[null,null,null,null,"Your School",null,null,null,"Your selection includes:",null,null,null,"All Kent Primary Schools"]
[null,null,null,null,{"$f":"IF(D4=\"\",\"\",\"Total Pupil Roll : \"&VLOOKUP($D$4,'2023-24 Data'!A3:I254,9,FALSE))","v":""},null,null,null,{"$f":"SUM('2023-24 Data'!M3:M254)&\" Schools\"","v":"0 Schools"}]
[null,{"$f":"IF(D4=\"\",\"\",VLOOKUP($D$4,'2023-24 Data'!A3:B254,2,0))","v":""},null,"total\nExp. / Inc.","amount\nper Pupil","% of total \nExp.","% of Exp / total inc.",null,{"$f":"E12","v":"amount\nper Pupil"},{"$f":"F12","v":"% of total \nExp."},{"$f":"G12","v":"% of Exp / total inc."},null,{"$f":"E12","v":"amount\nper Pupil"},{"$f":"F12","v":"% of total \nExp."},{"$f":"G12","v":"% of Exp / total inc."}]
[null,"(Total Revenue)",null,"£","£","%","%",null,"£","%","%",null,"£","%","%"]
[]
[null,"EXPENDITURE"]
{"$rows_left_out":61}
{"sheet":"2023-24 Data","index":2,"n_rows":263,"n_cols":76,"rows_kept":263,"cut":false,"hidden":true,"merged":[[0,69,0,71],[0,73,0,74],[0,4,0,5]]}
[null,"PFI School",{"$f":"\"Autumn \"&LEFT(Benchmarking!C1,4)-1&\" Roll\"","v":"Autumn 2022 Roll"},{"$f":"Benchmarking!C1&\" School Budget Templates\"","v":"2023-24 School Budget Templates"},"KCC Finance & Procurement",null,"Self generating",null,null,null,null,null,null,{"$f":"\"From \"&Benchmarking!C1&\" Checking Spreadsheet\"","v":"From 2023-24 Checking Spreadsheet"},null,null,null,null,null,null,null,null,null,null,null,null,null,null,null,null,null,null,null,null,null,null,null,null,null,null,null,null,null,null,null,null,"Self generating","KCC Finance & Procurement\nAll Negative figures","Self generating\n(HNOU, HNTU & HN3U)","Self generating\n(HNMT & HN3M)",{"$f":"N1","v":"From 2023-24 Checking Spreadsheet"},null,null,null,null,null,null,null,null,null,null,null,null,null,null,null,null,null,null,{"$f":"\"From March 20\"&RIGHT(Benchmarking!C1,2)&\" Advances\"","v":"From March 2024 Advances"},null,null,"Self generating",{"$f":"\"From March 20\"&RIGHT(Benchmarking!C1,2)&\" Advances\"","v":"From March 2024 Advances"},null,"Self generating"]
["DFE","SCHOOL","NURSERY NUMS","YR R-6 INC SRP","SRP FTE","HNP FTE","NURSERY","PHASE","SIZE CLASS","NURSERY SELECTA","PHASE SELECTA","SIZE SELECTA","OVERALL SLECTA","E01","E02","E03","E04","E05","E06","E07","E08","E09","E10","E11","E12","E13","E14","E15","E16","E17","E18","E19","E20","E21","E22","E23","E24","E25","E26","E27","E28","E28B","E29","E30","E31","E32","Funds delegated by the LEA (excluding High Needs)","Notional SEN Budget","Specially Rescourced Provision (Unit) Funding","Funding for High Needs Pupils","I04","I05","I06","I07","I08","I08b","I09","I10","I11","I12","I13","I15","I16","I17","I18","I18A","I18B","I18C","I01 + I03","HNOU","HNTU","HN3U","AV Total","HNMT","HN3M","AW Total"]
[2000,"St Johns CE Primary School, Canterbury",28,401,0,17,{"$f":"IF(C3=0,\"No\",\"Yes\")","v":"Yes"},"Primary",{"$f":"IFERROR(VLOOKUP($D3,$D$256:$F$261,3,TRUE),0)","v":"400-499"},{"$f":"IF(G3=Benchmarking!$I$4,1,0)","v":0},{"$f":"IF(Benchmarking!$I$6=\"All\",1,IF(Benchmarking!$I$6=H3,1,0))","v":0},{"$f":"SUBTOTAL(9,C3:K3)","v":446},{"$f":"IF(SUM(J3:L3)=3,1,0)","v":0},1307382.75,0,510084.61,77899.37,118776.87,0,119145.66,17354.939999999999,23424.37,802,10304.64,41832.550000000003,8718.8700000000008,30064.66,7017.87,73692.58,24576,16868.099999999999,106015.69,17403.37,0,14836.36,15474.16,4389.8,117583.19,92831.97,144446.18,58235.090000000004,0,0,32865.51,0,0,{"$f":"BQ3-AV3-AW3-AX3","v":-1797701.7000000004},-536590.34,{"$f":"-BU3","v":0},{"$f":"-BX3","v":-120505.18},0,-316872,-47485.760000000002,-42908.78,-35533.01,-18409.77,-2872.15,0,-32673.15,-6808.7,-2463.5,0,0,0,-53951,0,0,-51986.25,-2454797.2200000002,0,0,0,{"$f":"SUM(BR3:BT3)","v":0},0,120505.18,{"$f":"SUM(BV3:BW3)","v":120505.18}]
[2002,"Repton Manor Primary School",0,471,0,19,"No","Primary","400-499",{"$f":"IF(G4=Benchmarking!$I$4,1,0)","v":0},{"$f":"IF(Benchmarking!$I$6=\"All\",1,IF(Benchmarking!$I$6=H4,1,0))","v":0},{"$f":"IF(Benchmarking!$I$8=\"All\",1,IF(Benchmarking!$I$8=I4,1,0))","v":0},0,1261384.1299999999,3267.44,552586.25,28103.79,147103.08000000002,0,207121.76,637.48,6172,942,11958.72,19739.48,5228.66,48702.12,5149.53,67408.800000000003,10650,17768.41,118389.90000000001,26760.37,0,27585.510000000002,17635.59,23609.7,133728.36000000002,44876,30474.57,24500.98,0,0,0,0,0,-1812488.7,-337077.36,0,-135211.09000000003,0,-138730,-23615,-136455.84,-17810,-84921.11,-51706.61,0,0,-82262.52,-14180.68,0,0,0,-77606,0,0,-23326.670000000002,-2284777.15,0,0,0,0,0,135211.09000000003,135211.09000000003]
[2065,"Discovery School, The",0,618,0,18.583333333333332,"No","Primary","500+",{"$f":"IF(G5=Benchmarking!$I$4,1,0)","v":0},{"$f":"IF(Benchmarking!$I$6=\"All\",1,IF(Benchmarking!$I$6=H5,1,0))","v":0},{"$f":"IF(Benchmarking!$I$8=\"All\",1,IF(Benchmarking!$I$8=I5,1,0))","v":0},0,1673896.3399999999,0,782782.89,83265.03,154213.41,0,210989.53,15824.31,8036.25,1236,15464.51,22531.439999999999,8371.65,21707.06,9049.56,51027.96,75264,21991.65,123073.06,25464.600000000002,0,42945.86,23315.22,21306.600000000002,175734.66,22065.45,23331.19,62561.94,0,0,0,0,0,-2365042.21,-502529.79,0,-203809.97000000003,0,-81035,-43914.46,-3997.4700000000003,-24354.75,-111725.83,-80340.23,0,-14195.25,-64514.700000000004,-19923,0,0,0,-132409,0,0,-11787.710000000001,-3071381.97,0,0,0,0,0,203809.97000000003,203809.97000000003]
[2079,"Woodlands Primary School ",0,640,0,10.25,"No","Primary","500+",{"$f":"IF(G6=Benchmarking!$I$4,1,0)","v":0},{"$f":"IF(Benchmarking!$I$6=\"All\",1,IF(Benchmarking!$I$6=H6,1,0))","v":0},{"$f":"IF(Benchmarking!$I$8=\"All\",1,IF(Benchmarking!$I$8=I6,1,0))","v":0},0,1719014.15,27159.09,563292.88,50782.239999999998,122272.40000000001,0,1600.74,17051.04,13914.73,3933,16249.68,48996.03,92885.24,94549.400000000009,14060.17,69867.460000000006,65024,59950.400000000001,212065.59,31453.39,0,39138.26,23910.44,15651.18,120050.62,22781.41,13419.85,42410,0,0,94065,0,0,-2476768.83,-490201.26,0,-94216.7,0,-189845,-34858.86,-2400,-30417.98,-15642.2,0,0,-11073,-89625.400000000009,-6098.9000000000005,0,0,0,-110583,0,0,-30848.33,-3061186.79,0,0,0,0,0,94216.7,94216.7]
[2088,"Crockenhill Primary School",0,198,0,2.5,"No","Primary","100-199",{"$f":"IF(G7=Benchmarking!$I$4,1,0)","v":0},{"$f":"IF(Benchmarking!$I$6=\"All\",1,IF(Benchmarking!$I$6=H7,1,0))","v":0},{"$f":"IF(Benchmarking!$I$8=\"All\",1,IF(Benchmarking!$I$8=I7,1,0))","v":0},0,642878.75,4371.7300000000005,100358,34381.949999999997,64239.360000000001,0,46906.93,4112.66,1155,4388.93,5027.28,1594.13,1875.72,5415.7,6708.64,32764.510000000002,24116,7707.29,62501.279999999999,5658.91,0,14441.14,7544.78,3917.2200000000003,47247.51,25798.04,25434.21,29185.3,0,0,0,0,0,-898063.22000000009,-138340.82999999999,0,-22187.260000000006,0,-93895,-14015.53,0,-2999.92,-42206.18,0,0,-3052.57,-24972.43,-5423.9400000000005,0,0,0,-40926,0,0,-9289.89,-1058591.31,0,0,0,0,0,22187.260000000006,22187.260000000006]
[2089,"Anthony Roper Primary School, The",0,304,0,1.8333333333333333,"No","Primary","300-399",{"$f":"IF(G8=Benchmarking!$I$4,1,0)","v":0},{"$f":"IF(Benchmarking!$I$6=\"All\",1,IF(Benchmarking!$I$6=H8,1,0))","v":0},{"$f":"IF(Benchmarking!$I$8=\"All\",1,IF(Benchmarking!$I$8=I8,1,0))","v":0},0,803375.76,46309.61,249998.1,9559.08,70738.11,0,60919.46,2852,8521.5,8497.67,7718.64,11819.73,6612,25387.58,3878.69,42000.37,6604.8,24315.03,82732.930000000008,11424.1,0,17043.32,11583.95,28569.09,55445.47,23224,0,44839.19,0,0,2582,0,0,-1242735.83,-142096.97,0,-4608.3899999999994,0,-53770,-25073.83,-795.96,-16671.04,-3338.48,0,0,-17160.810000000001,-30615.88,-36389.39,0,0,0,-64837,0,0,-5496.29,-1389441.19,0,0,0,0,0,4608.3899999999994,4608.3899999999994]
[2094,"Cobham Primary School",0,218,0,6.25,"No","Primary","200-299",{"$f":"IF(G9=Benchmarking!$I$4,1,0)","v":0},{"$f":"IF(Benchmarking!$I$6=\"All\",1,IF(Benchmarking!$I$6=H9,1,0))","v":0},{"$f":"IF(Benchmarking!$I$8=\"All\",1,IF(Benchmarking!$I$8=I9,1,0))","v":0},0,587885.26,0,300111.95,22137.420000000002,40949.050000000003,0,15369.66,5303.4000000000005,7711.78,1561.24,5535,6276.7300000000005,19766.46,3478.7000000000003,100,29348.53,17216,9796.7000000000007,62431.41,7437.33,0,11972.41,8144.4400000000005,1870.66,36315.65,0,30916.15,21814.91,0,0,0,0,0,-907145.11,-102497.72,0,-34722.600000000006,0,-35550,-9835,-1460.42,-1905,-14963.76,0,-1320,-12258.08,-27780.9,-27451.47,0,0,0,-43278,0,0,-4131,-1044365.4299999999,0,0,0,0,0,34722.600000000006,34722.600000000006]
[2095,"Cecil Road Primary School",53,373,0,18.083333333333332,"Yes","Primary","300-399",{"$f":"IF(G10=Benchmarking!$I$4,1,0)","v":0},{"$f":"IF(Benchmarking!$I$6=\"All\",1,IF(Benchmarking!$I$6=H10,1,0))","v":0},{"$f":"IF(Benchmarking!$I$8=\"All\",1,IF(Benchmarking!$I$8=I10,1,0))","v":0},0,1173699.28,0,737585.3,43785.96,94092.83,0,18401.689999999999,1232.2,15061.78,14220.79,9733.44,14557.79,906.36,43549.35,7562.01,46672.270000000004,34048,10288.27,83335.320000000007,12774.93,0,21637.920000000002,14903.24,10751.29,67031.06,10211.120000000001,19224.53,29023.68,0,0,0,0,0,-1785382.5899999999,-251288.5,0,-130250.16999999998,0,-93205,-18959.86,-26184.13,-47487.5,-24159.850000000002,0,-10360,-3728.57,-15082.15,-8516.64,0,0,0,-70812,0,0,-13413.83,-2166921.2599999998,0,0,0,0,0,130250.16999999998,130250.16999999998]
[2109,"Higham Primary School",0,207,0,7.416666666666667,"No","Primary","200-299",{"$f":"IF(G11=Benchmarking!$I$4,1,0)","v":0},{"$f":"IF(Benchmarking!$I$6=\"All\",1,IF(Benchmarking!$I$6=H11,1,0))","v":0},{"$f":"IF(Benchmarking!$I$8=\"All\",1,IF(Benchmarking!$I$8=I11,1,0))","v":0},0,597218.38,4178.79,209993.79,59353.08,85759.89,39762.25,42456.37,4863.1900000000005,5265.5,5585.12,6773.76,5954.71,4212.83,3112.77,5170.95,33288.160000000003,22330,4186.42,66812.09,10773.78,0,8656.7100000000009,6215.52,2755.57,22487.71,19798,1330,16843.75,0,0,0,0,0,-876825.29,-103199.27,0,-58021.04,0,-51175,-9918,0,-1794,-36959.700000000004,-22370.39,0,-11848.89,-26256.670000000002,-20913.650000000001,0,0,0,-55893,0,0,-2703.05,-1038045.6000000001,0,0,0,0,0,58021.04,58021.04]
[2116,"Lawn Primary School",19,195,0,5.666666666666667,"Yes","Primary","100-199",{"$f":"IF(G12=Benchmarking!$I$4,1,0)","v":0},{"$f":"IF(Benchmarking!$I$6=\"All\",1,IF(Benchmarking!$I$6=H12,1,0))","v":0},{"$f":"IF(Benchmarking!$I$8=\"All\",1,IF(Benchmarking!$I$8=I12,1,0))","v":0},0,699051.57000000007,0,383475.29,67176.84,78783.930000000008,60438.18,83576.19,1143.1600000000001,13234.66,390,5043.4800000000005,4547.8900000000003,4549.6000000000004,1545.2,2254.2200000000003,37142.11,20459,9411.98,73754.39,5987.96,0,21269.95,7654.8,1487.45,28494.959999999999,0,5812.5,23316.03,0,0,2922.41,0,0,-997980.28000000026,-278290.93,0,-40302.759999999995,0,-158340,-11922,-24794.58,0,-25371.190000000002,-13105.17,0,0,-6384.91,0,0,0,0,-36277,0,0,-11073.79,-1316573.9700000002,0,0,0,0,0,40302.759999999995,40302.759999999995]
[2120,"Bean Primary School",0,183,0,3.5833333333333335,"No","Infant","100-199",{"$f":"IF(G13=Benchmarking!$I$4,1,0)","v":0},{"$f":"IF(Benchmarking!$I$6=\"All\",1,IF(Benchmarking!$I$6=H13,1,0))","v":0},{"$f":"IF(Benchmarking!$I$8=\"All\",1,IF(Benchmarking!$I$8=I13,1,0))","v":0},0,547273.30000000005,0,182237.93,32844.68,57617.130000000005,0,25657.08,3334.33,4388.45,379.8,4646.4000000000005,9205.17,12526.78,20099.510000000002,2895.69,19215.14,16717,10858.14,73652.67,23972.63,0,23783.010000000002,6973.21,1428.13,54754.73,562,13128.56,18713.68,0,0,41258.660000000003,0,0,-824622.85,-124485.26,0,-46103.889999999992,0,-58581,-9493,-4209.13,-3650,-26284.04,0,0,0,-22409.03,0,0,0,0,-46001,0,0,-9685.83,-995212,0,0,0,0,0,46103.889999999992,46103.889999999992]
[2128,"Capel Primary School",0,206,0,5.25,"No","Primary","200-299",{"$f":"IF(G14=Benchmarking!$I$4,1,0)","v":0},{"$f":"IF(Benchmarking!$I$6=\"All\",1,IF(Benchmarking!$I$6=H14,1,0))","v":0},{"$f":"IF(Benchmarking!$I$8=\"All\",1,IF(Benchmarking!$I$8=I14,1,0))","v":0},0,527541.48,0,228866.21,37974.120000000003,74617.570000000007,38282.32,62680.46,3991.14,5764.78,412,5230.32,8028.3,4185.22,3368.53,1397.08,28609.96,23827,8952.4500000000007,65723.490000000005,16626.95,0,10371.25,7696.12,2988.18,27378.690000000002,5817.84,24070.880000000001,13350.75,0,0,0,0,0,-879010.87,-90644.52,0,-42120.22,0,-49470,-10679.93,-440.93,-150,-49363.42,-16031.85,-28689.260000000002,0,-13200.52,-11534.050000000001,0,0,0,-49248,0,0,-2141.16,-1011775.61,0,0,0,0,0,42120.22,42120.22]
[2130,"Dunton Green Primary School",0,184,0,7.333333333333333,"No","Primary","100-199",{"$f":"IF(G15=Benchmarking!$I$4,1,0)","v":0},{"$f":"IF(Benchmarking!$I$6=\"All\",1,IF(Benchmarking!$I$6=H15,1,0))","v":0},{"$f":"IF(Benchmarking!$I$8=\"All\",1,IF(Benchmarking!$I$8=I15,1,0))","v":0},0,533601.96,0,232118.02000000002,34673.840000000004,55333.83,0,0,3883.96,6064,30833.21,4671.84,36346.43,12620.36,19250.98,381.69,28116.93,24576,11440.59,71092.430000000008,10966.18,0,11375.49,7011.35,15978.58,45543.14,1635.21,13085.32,49214.559999999998,0,0,0,0,0,-861592.87,-108600.49,0,-44190.420000000006,0,-87635,-11971.06,-15135.550000000001,-10596,-2758.75,-7367.9800000000005,-3360,-6712.2300000000005,-19353.18,-2509.4500000000003,0,0,0,-44618,0,0,-14525.83,-1014383.78,0,0,0,0,0,44190.420000000006,44190.420000000006]
{"$rows_left_out":249}
{"sheet":"PFI Adjustments","index":3,"n_rows":8,"n_cols":17,"rows_kept":8,"cut":false,"hidden":true,"merged":[[4,0,4,1],[3,10,3,15]]}
["PFI Breakdown",null,null,"E12","E13","E15","E23","E24","E28"]
[2689,"The Craylands School",{"$f":"\"Closedown figures from 20\"&RIGHT(Benchmarking!C1,5)&CHAR(10)&\" Checking Spreadsheet\"","v":"Closedown figures from 2023-24\n Checking Spreadsheet"},7206.98,24.47,2322.4,15040,335,23235.45]
[]
[null,null,null,null,null,null,null,null,null,null,"Standard percentage figures for 2014-15 to 2017-18\nChanges to 2023-24  in line with new CFR Pack"]
["PFI Breakdown",null,{"$f":"\"E28B total from \n20\"&RIGHT(Benchmarking!C1,5)&CHAR(10)&\" Checking Spreadsheet\"","v":"E28B total from \n2023-24\n Checking Spreadsheet"},"E12","E13","E15","E23","E24","E28",null,"E12","E13","E15","E23","E24","E28","Comments"]
[2689,"The Craylands School",373869.31,{"$f":"$C6*K6","v":41806.477138322232},6266.9153466756879,2991.7670618151928,33553.478764424821,237324.42866149935,51926.243027262739,null,0.11182109903142955,1.6762315544636943E-2,8.002173438133215E-3,8.9746544760319652E-2,0.63477911214883975,0.13888875507664092,"Calculation"]
[]
[2689,"The Craylands School","Adjusted PFI Figures",{"$f":"D2+D6","v":49013.457138322236},6291.3853466756882,5314.1670618151929,48593.478764424821,237659.42866149935,75161.693027262736]