{"text_format":"1","workbook":"xlsx","n_sheets":4,"sheets":["Introduction","Benchmarking","2023-24 Data","PFI Adjustments"],"not_rendered":{"charts":0,"images":2,"macros":1,"external_links":0,"defined_names":4,"comments":0,"pivot_tables":0},"unopened":[],"bounds":{"document_bytes":16777216,"sheet_cells":100000,"rows_first":2000,"rows_last":500,"rows_between":2000,"halvings":0,"cell_chars":16384,"cell_head_chars":4096},"cells_cut":0,"cells_raw":0,"read":"whole","date_system":"1900"}

{"sheet":"Introduction","index":0,"n_rows":18,"n_cols":5,"rows_kept":18,"cut":false,"hidden":false,"merged":[[12,4,13,4]]}
[]
[]
[null,{"$f":"Benchmarking!C1&\" Data\"","v":"2023-24 Data"},null,null,{"$f":"\"Kent LA Schools' Benchmarking Data \"&Benchmarking!C1","v":"Kent LA Schools' Benchmarking Data 2023-24"}]
[]
[null,null,null,null,"THIS BENCHMARKING SHEET IS FOR SECONDARY SCHOOLS ONLY"]
[]
[null,null,null,null,{"$f":"\"The Benchmarking spreadsheet shows the income and expenditure information for the \"&Benchmarking!C1&\" financial year at subjective account level i.e. CFR codes. It shows all revenue income and expenditure including standards funds.\"","v":"The Benchmarking spreadsheet shows the income and expenditure information for the 2023-24 financial year at subjective account level i.e. CFR codes. It shows all revenue income and expenditure including standards funds."}]
[]
[null,null,null,null,"Capital income and expenditure is excluded."]
[]
[null,null,null,null,"Enter your DFE number in the green shaded box, you can enter the last four digits or use the drop down box.  "]
[]
[null,null,null,null,"The green drop down boxes allow you to select up to three Schools to benchmark against, the grey area allows you to benchmark against the average of the Schools you selected"]
[]
[]
{"$rows_left_out":4}
{"sheet":"Benchmarking","index":1,"n_rows":72,"n_cols":22,"rows_kept":72,"cut":false,"hidden":false,"merged":[[7,3,7,5],[6,7,6,9],[51,4,52,17],[3,7,3,9],[3,11,3,13],[7,11,7,13],[7,7,7,9],[5,1,6,4],[6,19,7,21],[2,7,2,9],[2,11,2,13],[2,15,2,17],[3,15,3,17],[7,15,7,17],[6,11,6,13],[6,15,6,17]]}
[null,"Subjective Analysis of ","2023-24"," Income and Expenditure Compared to Group and Phase Averages"]
[]
[null,null,null,null,"11-16","Post 16",null,"Select a school to Benchmark against",null,null,null,"Select a school to Benchmark against",null,null,null,"Select a school to Benchmark against"]
[null,"Enter last 4 digits of your DfE No.",null,"Pupil Roll",{"$f":"IF(ISERROR(VLOOKUP(C4,'2023-24 Data'!$A$3:$C$19,3,0)),\"\",VLOOKUP(C4,'2023-24 Data'!$A$3:$C$19,3,0)+VLOOKUP(C4,'2023-24 Data'!$A$3:$E$19,5,0))","v":""},{"$f":"IF(ISERROR(VLOOKUP(C4,'2023-24 Data'!$A$3:$D$19,4,0)),\"\",VLOOKUP(C4,'2023-24 Data'!$A$3:$D$19,4,0))","v":""}]
[null,null,null,null,null,null,null,null,"11-16","Post 16",null,null,"11-16","Post 16",null,null,"11-16","Post 16"]
[null,{"$f":"B1&C1&D1","v":"Subjective Analysis of 2023-24 Income and Expenditure Compared to Group and Phase Averages"},null,null,null,null,null,{"$f":"IF(ISERROR(SUMIF(schools,H4,dfenums)),\"\",SUMIF(schools,H4,dfenums))","v":0},{"$f":"IF(ISERROR(VLOOKUP(H6,'2023-24 Data'!$A$3:$C$19,3,0)),\"\",VLOOKUP(H6,'2023-24 Data'!$A$3:$C$19,3,0))","v":""},{"$f":"IF(ISERROR(VLOOKUP(H6,'2023-24 Data'!$A$3:$D$19,4,0)),\"\",VLOOKUP(H6,'2023-24 Data'!$A$3:$D$19,4,0))","v":""},null,{"$f":"IF(ISERROR(SUMIF(schools,L4,dfenums)),\"\",SUMIF(schools,L4,dfenums))","v":0},{"$f":"IF(ISERROR(VLOOKUP(L6,'2023-24 Data'!$A$3:$C$19,3,0)),\"\",VLOOKUP(L6,'2023-24 Data'!$A$3:$C$19,3,0))","v":""},{"$f":"IF(ISERROR(VLOOKUP(L6,'2023-24 Data'!$A$3:$D$19,4,0)),\"\",VLOOKUP(L6,'2023-24 Data'!$A$3:$D$19,4,0))","v":""},null,{"$f":"IF(ISERROR(SUMIF(schools,P4,dfenums)),\"\",SUMIF(schools,P4,dfenums))","v":0},{"$f":"IF(ISERROR(VLOOKUP(P6,'2023-24 Data'!$A$3:$C$19,3,0)),\"\",VLOOKUP(P6,'2023-24 Data'!$A$3:$C$19,3,0))","v":""},{"$f":"IF(ISERROR(VLOOKUP(P6,'2023-24 Data'!$A$3:$D$19,4,0)),\"\",VLOOKUP(P6,'2023-24 Data'!$A$3:$D$19,4,0))","v":""}]
[null,null,null,null,null,null,null,{"$f":"IF(H4=\"\",\"\",IF(C4=H6,\"This is your school\",\"\"))","v":""},null,null,null,{"$f":"IF(L4=\"\",\"\",IF(L6=H6,\"You have already selected this school\",IF(L6=C4,\"This is your school\",\"\")))","v":""},null,null,null,{"$f":"IF(P4=\"\",\"\",IF(OR(P6=L6,P6=H6),\"You have already selected this school\",IF(P6=C4,\"This is your school\",\"\")))","v":""},null,null,null,"All Kent Secondary Schools"]
[]
[null,{"$f":"IF(C4=\"\",\"\",VLOOKUP($C$4,'2023-24 Data'!A3:B279,2,0))","v":""},null,"total\nExp. / Inc.","amount\nper Pupil","% of total \nExp.",null,"total\nExp. / Inc.","amount\nper Pupil","% of total \nExp.",null,"total\nExp. / Inc.","amount\nper Pupil","% of total \nExp.",null,"total\nExp. / Inc.","amount\nper Pupil","% of total \nExp.",null,"amount\nper Pupil","% of total \nExp.","% of Exp / total inc."]
[null,null,null,"£","£","%",null,"£","£","%",null,"£","£","%",null,"£","£","%",null,"£","%","%"]
[]
[null,"EXPENDITURE"]
[null,"Teaching staff","E01",{"$f":"IF(ISERROR(INDEX('2023-24 Data'!$B$3:$BJ$19,MATCH($C$4,dfenums,0),MATCH($C13,'2023-24 Data'!$B$2:$BJ$2,0))),\"\",INDEX('2023-24 Data'!$B$3:$BJ$19,MATCH($C$4,dfenums,0),MATCH($C13,'2023-24 Data'!$B$2:$BJ$2,0)))","v":""},{"$f":"IF($C$4>0,D13/($E$4+$F$4),\"\")","v":""},{"$f":"IF($C$4>0,D13/$D$46,\"\")","v":""},null,{"$f":"IF(ISERROR(INDEX('2023-24 Data'!$B$3:$BJ$19,MATCH($H$6,dfenums,0),MATCH($C13,'2023-24 Data'!$B$2:$BJ$2,0))),\"\",INDEX('2023-24 Data'!$B$3:$BJ$19,MATCH($H$6,dfenums,0),MATCH($C13,'2023-24 Data'!$B$2:$BJ$2,0)))","v":""},{"$f":"IF($H$6>0,H13/($I$6+$J$6),\"\")","v":""},{"$f":"IF($H$6>0,H13/$H$46,\"\")","v":""},null,{"$f":"IF(ISERROR(INDEX('2023-24 Data'!$B$3:$BJ$19,MATCH($L$6,dfenums,0),MATCH($C13,'2023-24 Data'!$B$2:$BJ$2,0))),\"\",INDEX('2023-24 Data'!$B$3:$BJ$19,MATCH($L$6,dfenums,0),MATCH($C13,'2023-24 Data'!$B$2:$BJ$2,0)))","v":""},{"$f":"IF($L$6>0,L13/($M$6+$N$6),\"\")","v":""},{"$f":"IF($L$6>0,L13/$L$46,\"\")","v":""},null,{"$f":"IF(ISERROR(INDEX('2023-24 Data'!$B$3:$BJ$19,MATCH($P$6,dfenums,0),MATCH($C13,'2023-24 Data'!$B$2:$BJ$2,0))),\"\",INDEX('2023-24 Data'!$B$3:$BJ$19,MATCH($P$6,dfenums,0),MATCH($C13,'2023-24 Data'!$B$2:$BJ$2,0)))","v":""},{"$f":"IF($P$6>0,P13/($Q$6+$R$6),\"\")","v":""},{"$f":"IF($P$6>0,P13/$P$46,\"\")","v":""},null,{"$f":"IF(ISERROR(SUM('2023-24 Data'!F$3:F$19)/SUM('2023-24 Data'!$C$3:$D$19)),\"\",SUM('2023-24 Data'!F$3:F$19)/SUM('2023-24 Data'!$C$3:$D$19))","v":5132.468644386704},{"$f":"IF(ISERROR(T13/$T$46),\"\",T13/$T$46)","v":0.53195605631465548},{"$f":"IF(ISERROR(T13/-$T$72),\"\",T13/-$T$72)","v":5.531126141268018E-3}]
[null,"Supply teaching staff","E02",{"$f":"IF(ISERROR(INDEX('2023-24 Data'!$B$3:$BJ$19,MATCH($C$4,dfenums,0),MATCH($C14,'2023-24 Data'!$B$2:$BJ$2,0))),\"\",INDEX('2023-24 Data'!$B$3:$BJ$19,MATCH($C$4,dfenums,0),MATCH($C14,'2023-24 Data'!$B$2:$BJ$2,0)))","v":""},"","",null,{"$f":"IF(ISERROR(INDEX('2023-24 Data'!$B$3:$BJ$19,MATCH($H$6,dfenums,0),MATCH($C14,'2023-24 Data'!$B$2:$BJ$2,0))),\"\",INDEX('2023-24 Data'!$B$3:$BJ$19,MATCH($H$6,dfenums,0),MATCH($C14,'2023-24 Data'!$B$2:$BJ$2,0)))","v":""},{"$f":"IF($H$6>0,H14/($I$6+$J$6),\"\")","v":""},{"$f":"IF($H$6>0,H14/$H$46,\"\")","v":""},null,{"$f":"IF(ISERROR(INDEX('2023-24 Data'!$B$3:$BJ$19,MATCH($L$6,dfenums,0),MATCH($C14,'2023-24 Data'!$B$2:$BJ$2,0))),\"\",INDEX('2023-24 Data'!$B$3:$BJ$19,MATCH($L$6,dfenums,0),MATCH($C14,'2023-24 Data'!$B$2:$BJ$2,0)))","v":""},{"$f":"IF($L$6>0,L14/($M$6+$N$6),\"\")","v":""},{"$f":"IF($L$6>0,L14/$L$46,\"\")","v":""},null,{"$f":"IF(ISERROR(INDEX('2023-24 Data'!$B$3:$BJ$19,MATCH($P$6,dfenums,0),MATCH($C14,'2023-24 Data'!$B$2:$BJ$2,0))),\"\",INDEX('2023-24 Data'!$B$3:$BJ$19,MATCH($P$6,dfenums,0),MATCH($C14,'2023-24 Data'!$B$2:$BJ$2,0)))","v":""},{"$f":"IF($P$6>0,P14/($Q$6+$R$6),\"\")","v":""},{"$f":"IF($P$6>0,P14/$P$46,\"\")","v":""},null,{"$f":"IF(ISERROR(SUM('2023-24 Data'!G$3:G$19)/SUM('2023-24 Data'!$C$3:$D$19)),\"\",SUM('2023-24 Data'!G$3:G$19)/SUM('2023-24 Data'!$C$3:$D$19))","v":9.294188692769465},{"$f":"IF(ISERROR(T14/$T$46),\"\",T14/$T$46)","v":9.6329862025697677E-4},{"$f":"IF(ISERROR(T14/-$T$72),\"\",T14/-$T$72)","v":1.0016102114267793E-5}]
[null,"Education support staff","E03",{"$f":"IF(ISERROR(INDEX('2023-24 Data'!$B$3:$BJ$19,MATCH($C$4,dfenums,0),MATCH($C15,'2023-24 Data'!$B$2:$BJ$2,0))),\"\",INDEX('2023-24 Data'!$B$3:$BJ$19,MATCH($C$4,dfenums,0),MATCH($C15,'2023-24 Data'!$B$2:$BJ$2,0)))","v":""},"","",null,{"$f":"IF(ISERROR(INDEX('2023-24 Data'!$B$3:$BJ$19,MATCH($H$6,dfenums,0),MATCH($C15,'2023-24 Data'!$B$2:$BJ$2,0))),\"\",INDEX('2023-24 Data'!$B$3:$BJ$19,MATCH($H$6,dfenums,0),MATCH($C15,'2023-24 Data'!$B$2:$BJ$2,0)))","v":""},"","",null,{"$f":"IF(ISERROR(INDEX('2023-24 Data'!$B$3:$BJ$19,MATCH($L$6,dfenums,0),MATCH($C15,'2023-24 Data'!$B$2:$BJ$2,0))),\"\",INDEX('2023-24 Data'!$B$3:$BJ$19,MATCH($L$6,dfenums,0),MATCH($C15,'2023-24 Data'!$B$2:$BJ$2,0)))","v":""},"","",null,{"$f":"IF(ISERROR(INDEX('2023-24 Data'!$B$3:$BJ$19,MATCH($P$6,dfenums,0),MATCH($C15,'2023-24 Data'!$B$2:$BJ$2,0))),\"\",INDEX('2023-24 Data'!$B$3:$BJ$19,MATCH($P$6,dfenums,0),MATCH($C15,'2023-24 Data'!$B$2:$BJ$2,0)))","v":""},"","",null,{"$f":"IF(ISERROR(SUM('2023-24 Data'!H$3:H$19)/SUM('2023-24 Data'!$C$3:$D$19)),\"\",SUM('2023-24 Data'!H$3:H$19)/SUM('2023-24 Data'!$C$3:$D$19))","v":999.77418130095862},0.10362185675926759,1.0774302762875129E-3]
{"$rows_left_out":58}
{"sheet":"2023-24 Data","index":2,"n_rows":29,"n_cols":71,"rows_kept":29,"cut":false,"hidden":true,"merged":[[0,3,0,4]]}
[null,"PFI School",{"$f":"Benchmarking!C1&\" School Budget Templates\"","v":"2023-24 School Budget Templates"},"KCC Finance & Procurement",null,{"$f":"\"From \"&Benchmarking!C1&\" Checking Spreadsheet\"","v":"From 2023-24 Checking Spreadsheet"},null,null,null,null,null,null,null,null,null,null,null,null,null,null,null,null,null,null,null,null,null,null,null,null,null,null,null,null,null,null,null,null,"Self generating","KCC Finance & Procurement\nMinus figure","Self generating\nHN12, HN3U, HNOU, HNTU & HNUT","Self generating\nFrom Advances\nHNMT & HN3M",{"$f":"F1","v":"From 2023-24 Checking Spreadsheet"},null,null,null,null,null,null,null,null,null,null,null,null,null,null,null,null,null,null,null,{"$f":"\"From March 20\"&RIGHT(Benchmarking!C1,2)&\" Advances\"","v":"From March 2024 Advances"},null,null,null,null,null,{"$f":"\"From March 20\"&RIGHT(Benchmarking!C1,2)&\" Advances\"","v":"From March 2024 Advances"}]
["DFE","SCHOOL","11-16 ROLL","POST-16 ROLL","SRP- ROLL","E01","E02","E03","E04","E05","E06","E07","E08","E09","E10","E11","E12","E13","E14","E15","E16","E17","E18","E19","E20","E21","E22","E23","E24","E25","E26","E27","E28","E28B","E29","E30","E31","E32","I01 OTHER","Notional SEN budget","Unit Funding","HNP Funding","I02","I04","I05","I06","I07","I08","I08b","I09","I10","I11","I12","I13","I15","I16","I17","I18","I18A","I18B","I18C","I01 + I03","HN12","HN3U","HNOU","HNTU","HNUT","AN Total","HNMT","HN3M","AM Total"]
[4026,"Dartford Science & Technology College",744,0,0,3485000.09,25179.66,872934.01,196394.85,362911.21,0,3173.05,16371.56,20419.7,1544.1000000000001,3935.04,87818.73,19417.060000000001,16383.43,11234.39,222745.62,244480,49792.49,186705.25,44406.96,85855.44,73325.930000000008,23398.760000000002,609,65408.1,49956.630000000005,77982.009999999995,41984.56,0,0,256904.25,0,0,{"$f":"BJ3-AN3-AO3-AP3","v":-4479116.0999999996},-584920.29,{"$f":"BP3","v":0},{"$f":"BS3","v":-153887.30000000005},-727958.47,0,-186072.93,-56308.18,-46778,-99206.92,-43082.79,0,0,0,0,-42373.75,0,0,0,0,0,0,-37653.75,-5217923.6899999995,0,0,0,0,0,{"$f":"-SUM(BK3:BO3)","v":0},0,153887.30000000005,{"$f":"-SUM(BQ3:BR3)","v":-153887.30000000005}]
[4040,"Northfleet School for Girls",1007,0,0,4659056.18,0,1191043.0900000001,200343.29,412343.27,177580.87,46240.840000000004,54257.520000000004,59318.89,2014,37598.160000000003,256995.08000000002,19363.420000000002,214495.09,16661.830000000002,194304.13,33280,30653.3,495863.65,158940.01999999999,177736.48,57343.71,33419.800000000003,33876.270000000004,353283.02,218398.98,133072.08000000002,28481.9,0,15743.78,0,0,0,-5576743.0199999996,-1152336.08,{"$f":"BP4","v":0},{"$f":"BS4","v":-33566.94},-1260366.24,0,-375392.84,-111124.32,-132809.83000000002,-61441.05,-58142.76,-371036.58,0,-20494.32,-172857.85,-70224.100000000006,0,0,0,0,0,0,-133610.01,-6762646.04,0,0,0,0,0,{"$f":"-SUM(BK4:BO4)","v":0},0,33566.94,{"$f":"-SUM(BQ4:BR4)","v":-33566.94}]
[4043,"Tunbridge Wells Girls' Grammar School",732,0,0,3793501.4699999997,0,533047.87,93954.53,388648.28,0,1192.6400000000001,26605.09,17801.189999999999,1464,27755.4,90889.84,40438.700000000004,145722.09,9102.33,186849.76,58368,45847.03,604765.11,90242.180000000008,116829.76000000001,36376.11,25992.600000000002,0,13262.28,786.24,83522.5,38929.07,0,0,0,0,0,-3995881.64,-416276.49,0,-93671.26999999999,-1363981.74,0,-21405,-50004.65,-55713.97,0,-4568.57,-15000,0,0,0,-496570.3,0,0,0,0,0,0,-9268.630000000001,-4505829.4000000004,0,0,0,0,0,0,0,93671.26999999999,-93671.26999999999]
[4045,"Tunbridge Wells Grammar School for Boys",1293,0,0,5488737.9100000001,0,912307.95000000007,129053.66,779963.98,0,46723.63,67627.81,19460.13,2586,7377.24,293075.84000000003,37168.76,233192.93,442.74,374661.41000000003,166400,59128.959999999999,892192.33000000007,214871.63,171158.55000000002,79669.11,43565,1974.3400000000001,32415.09,98333.930000000008,59104.08,68524.11,0,50785.06,70351,0,0,-7184700.0899999989,-838211.58,0,-11632.399999999998,-1714372.35,0,-87840,-94283.02,-3583.9500000000003,-88030.52,-32039.91,-25000,0,0,-550818.49,-151673.70000000001,0,0,0,0,0,0,-28219.62,-8034544.0699999994,0,0,0,0,0,0,0,11632.399999999998,-11632.399999999998]
[4109,"Dover Grammar School for Girls",675,0,0,3637182.21,5913.95,474766.32,180572.25,364245.4,0,13833.75,22203.21,13377.14,1350,25241.760000000002,26180.54,11320.37,19610.78,16843.990000000002,90858.2,92672,18567.41,282149.01,74787.63,89071.17,46706.879999999997,22559.16,0,53047.06,39965,67076.33,45811.4,0,1481.53,0,0,0,-3788547.19,-335739.49,0,-37500.310000000005,-1122041.5,0,-126276,-74640.39,-20629.45,0,-23326.62,0,0,-42006.79,-118347.12,-28705.43,0,0,0,0,0,0,-42204.88,-4161786.99,0,0,0,0,0,0,0,37500.310000000005,-37500.310000000005]
[4522,"Maidstone Grammar School",1050,0,0,4766785.45,0,732360.12,204408.21,399553.36,0,22484.27,59397.82,35459.770000000004,2100,40323.19,139790.44,83286.98,172178.34,34966.49,253075.59,45056,64251.21,586014.57999999996,208867.46,200089.25,142758.44,48108.11,78617.150000000009,430519.32,36874.840000000004,45588.51,56204.1,0,0,439479.03,0,0,-5662154.5200000005,-629784.48,0,-2242.9500000000003,-2031801.31,0,-81575,-64635,-720,-102405.31,-50782.090000000004,-381095.26,0,-5186.9000000000005,-293592.18,-134017.12,0,0,0,0,0,0,-15144.880000000001,-6294181.9500000002,0,0,0,0,0,0,0,2242.9500000000003,-2242.9500000000003]
[4523,"Maidstone Grammar School for Girls",862,0,0,4193280.99,0,582152.23,104950.86,523944.22000000003,0,16874.53,56136.82,21997.83,1724,32473.68,58682.590000000004,14247.42,191942.80000000002,48287.950000000004,354025.83,35328,42568.44,396212.21,73728.69,157970.76999999999,64293.440000000002,29764.639999999999,314125.13,42324.98,97224.16,52247.9,54452.35,0,0,335580.7,0,0,-4774023.55,-475810.4,0,0,-1611401,0,-96260,-54928.93,-245246.55000000002,-355840.69,0,-10674.050000000001,0,-20248.310000000001,-215828.30000000002,-11250.25,0,0,0,0,0,0,-25084.65,-5249833.95,0,0,0,0,0,0,0,0,0]
[4534,"Simon Langton Girls' Grammar School",880,0,0,4641333.99,18682.87,637982.32999999996,129712.26000000001,487961.28,121953.65000000001,43207.42,19115.05,27589.61,1760,5711.04,51939.21,31775.06,132108.97,27553.05,188834.56,256637.98,49275.65,523284.11,46242.38,143961.01999999999,67581.78,31573.64,0,271899.09000000003,0,21515.5,54733.32,0,0,221099.97,0,0,-4988138.2,-509895.8,0,-37283.020000000011,-1847091.97,0,-86155,-74007.930000000008,-14221.15,-34890.699999999997,-30834.639999999999,-348953.61,0,-1508.04,0,-313755.81,0,0,0,0,0,0,-15290,-5535317.0199999996,0,0,0,0,0,0,0,37283.020000000011,-37283.020000000011]
[4622,"Judd School, The",952,0.33333333333333331,18.75,5655855.1699999999,1063.8399999999999,1051268.46,464336.01,532823.4,0,0,49533.760000000002,27097.78,1904,0,198831.56,80027.13,25543.37,23320.06,253849.28,54272,23022.010000000002,1378770.63,56301.200000000004,220194.44,58330.39,44901.58,0,48983.82,74873.88,250,95060.540000000008,0,11194.91,0,0,0,-5170876.1000000006,-576051.30000000005,-320388,-14477.22,-2897646.2800000003,0,-30905,-65794.7,-2040,-37351.279999999999,-438464.94,-25000,0,-3844,0,-678403.76,0,0,0,0,0,0,-16300.140000000001,-6081792.6200000001,0,189054.66999999998,9333.33,122000,0,-320388,0,14477.22,-14477.22]
[5407,"Thamesview School",872,0,5.583333333333333,3506215.2,0,1139880.8500000001,38056.17,388786.13,0,65685.13,54723.630000000005,57523.5,1744,31306.920000000002,262080.25893474836,39467.936413313859,84.070000000000007,17751.701841269391,17112.37,45568,14042.15,238247.17,125552.42,104517.07,51419.65,89347.762172195202,26177.79,69237.119999999995,285711.10000000003,231134.7,1816679.3606384727,0,0,27480.87,0,0,-6047440.5300000003,-1139189.1299999999,-132563.71000000002,-107710.91000000002,-335206.63,0,-396855.5,-82855.3,-113273.21,-2047.65,0,0,0,-18674.96,-1320,0,0,0,0,0,0,0,-141330.79,-7426904.2800000003,0,66563.710000000006,12000,54000,0,-132563.71000000002,0,107710.91000000002,-107710.91000000002]
[5412,"Simon Langton Grammar School for Boys",782,6.5,31,4917510.1399999997,0,906885.59,292156.74,364348.05,203358.01,54877.919999999998,32891.520000000004,25549.73,1564,30139.200000000001,177773.77,48463.28,15125.61,37957.89,226299.4,32256,50058.81,513240.76,247811.77000000002,124851.41,81559.960000000006,35770.550000000003,251955.37,234234.71,13427.130000000001,22514.79,122691.37,0,52930.03,31990.74,0,0,-4302613.6499999994,-448357.17,-564580.78,-34706.32,-2649995.48,0,-53600,-88206.76,-50020.55,-114396.39,-163034.30000000002,-358367.23,-15124.130000000001,0,-302213.65000000002,-746.94,0,0,0,0,0,0,-28127.510000000002,-5350257.92,15000,339580.78,0,210000,0,-564580.78,0,34706.32,-34706.32]
[5425,"Malling School, The",903,18,102.66666666666667,5276151.34,4609.3900000000003,1269885.77,0,444176.54000000004,0,31032.27,29164.61,41924.04,1806,32923.56,138391.26302874243,54487.102992277352,146.58000000000001,24680.83968744515,0,33792,6760.35,465568.76,102997.54000000001,130000,45223.31,64464.725973304674,1354964.3957479992,10875.32,1191.01,221458.61000000002,144185.8025702312,0,0,0,0,0,-5810427.9299999997,-880799.08,-1394747.9900000002,-176074.71000000002,-808522.9,0,-258991,-216882.45,-137304.74,-40588.559999999998,-12991,0,0,-28463,-34760.03,-18993.52,0,0,0,0,0,0,-146120.41,-8262049.71,15000,647747.99000000011,12000,600000,120000,-1394747.9900000002,0,176074.71000000002,-176074.71000000002]
[5426,"Archbishop's School, The",622,0.5,4.583333333333333,3188282.17,52367.48,821595.98,241011.82,388674.35000000003,51382.03,25932.5,15487.31,26383.03,1244,22719.119999999999,44597.49,16205.12,18008.740000000002,16461.53,180018.15,23961.600000000002,29397.75,226869.17,68844.72,124002.63,57497.47,19129.400000000001,4504.71,114833.65000000001,202075.89,368663.74,50816.81,0,1037.69,34409.879999999997,0,0,-3863740.0100000007,-1020140.63,-76814.539999999994,-84732.549999999988,-442871.9,-58500,-349955.39,-102507.89,-237519.98,-11740,-25341.31,-35676.54,0,-9879.3000000000011,-42427,-57468.639999999999,0,0,0,0,0,0,-81086.16,-5045427.7300000004,0,26814.539999999994,7999.9999999999991,42000,0,-76814.539999999994,0,84732.549999999988,-84732.549999999988]
{"$rows_left_out":15}
{"sheet":"PFI Adjustments","index":3,"n_rows":20,"n_cols":17,"rows_kept":20,"cut":false,"hidden":true,"merged":[[8,0,8,1],[1,2,5,2],[15,2,19,2]]}
["PFI Breakdown",null,null,"E12","E13","E15","E23","E24","E28"]
[5407,"Thamesview School",null,36735.43,0,0,24595.100000000002,26177.79,48156.38]
[5425,"The Malling School",null,44597.49,16205.12,16461.53,19129.400000000001,4504.71,50816.81]
[5431,"Hugh Christie Technology College",null,15383.31,0,0,29042.74,320449.03000000003,25289.760000000002]
[5456,"Northfleet Technology College",null,3466.34,0,166.97,23043.68,0,43086.38]
[5461,"St Johns RC Comprehensive School",null,739,0,0,31442.36,0,46004.94]
[]
[null,null,null,null,null,null,null,null,null,null,"Standard percentage figures for 2014-15 to 2017-18"]
["PFI Breakdown",null,{"$f":"\"E28B total from\"&CHAR(10)&\" 20\"&RIGHT(Benchmarking!C1,5)&CHAR(10)&\" Checking Spreadsheet\"","v":"E28B total from\n 2023-24\n Checking Spreadsheet"},"E12","E13","E15","E23","E24","E28",null,"E12","E13","E15","E23","E24","E28","Comments"]
[5407,"Thamesview School",2115840.11,{"$f":"$C10*K10","v":225344.82893474837},39467.936413313859,17751.701841269391,64752.662172195196,0,1768522.9806384728,null,0.10650371352244967,1.8653553369547316E-2,8.3899070432450554E-3,3.0603759644293349E-2,0,0.83584906642046453,"Supplied by School"]
[5425,"The Malling School",1629459.07,93793.773028742435,38281.98299227735,8219.3096874451494,45335.325973304673,1350459.6857479992,93368.992570231218,null,5.7561294269725005E-2,2.3493675721647522E-2,5.0441952417038301E-3,2.7822316502435787E-2,0.82877791201469042,5.7300606249797492E-2,"Calculation"]
[5431,"Hugh Christie Technology College",1376335.43,105589.57836733705,43158.921468947687,16547.070755346402,41355.746206187854,1137973.3498687383,31710.763333442705,null,7.6717910522246052E-2,3.1357851093717533E-2,1.2022556707231175E-2,3.0047723327290828E-2,0.82681396196328272,2.3039996386231738E-2,"Calculation"]
[5456,"Northfleet Technology College",1228493.24,102018.16081397685,24488.036174090415,13915.322182617019,20380.336165937028,1056962.6059858075,10728.778677571154,null,8.3043322903410405E-2,1.9933391065375675E-2,1.1327145913002353E-2,1.6589701515929405E-2,0.86037315596934627,8.7332826329359001E-3,"Supplied by School"]
[5461,"St Johns RC Comprehensive School",2036321.76,160296.83525640928,32155.085881597002,20208.893578632062,73625.512137205413,1691387.7236451895,58647.709500966805,null,7.8718814681040028E-2,1.5790768685591712E-2,9.924214323885662E-3,3.6156128949486555E-2,0.83060926660489531,2.8800806755100827E-2,"Calculation"]
[]
{"$rows_left_out":5}