{"text_format":"1","workbook":"xlsx","n_sheets":3,"sheets":["Introduction","Benchmarking","2023-24 Data"],"not_rendered":{"charts":0,"images":2,"macros":1,"external_links":0,"defined_names":4,"comments":0,"pivot_tables":0},"unopened":[],"bounds":{"document_bytes":16777216,"sheet_cells":100000,"rows_first":2000,"rows_last":500,"rows_between":2000,"halvings":0,"cell_chars":16384,"cell_head_chars":4096},"cells_cut":0,"cells_raw":0,"read":"whole","date_system":"1900"}

{"sheet":"Introduction","index":0,"n_rows":21,"n_cols":4,"rows_kept":21,"cut":false,"hidden":false,"merged":[[6,3,9,3],[13,3,15,3]]}
[]
[]
[null,{"$f":"Benchmarking!C1&\" Data\"","v":"2023-24 Data"},null,{"$f":"\"Kent LA Schools' Benchmarking Data \"&Benchmarking!C1","v":"Kent LA Schools' Benchmarking Data 2023-24"}]
[]
[null,null,null,"THIS BENCHMARKING SHEET IS FOR SPECIAL SCHOOLS ONLY"]
[]
{"$rows_left_out":16}
{"sheet":"Benchmarking","index":1,"n_rows":69,"n_cols":22,"rows_kept":69,"cut":false,"hidden":false,"merged":[[3,4,3,5],[2,8,2,11],[2,13,2,16],[2,18,2,21],[3,18,3,21],[3,13,3,16],[3,8,3,11],[4,1,6,5],[7,3,7,6],[6,8,6,11],[7,18,7,21],[5,9,5,11],[4,9,4,11],[7,13,7,16],[5,19,5,21],[7,8,7,11],[5,14,5,16],[4,14,4,16],[4,19,4,21],[6,13,6,16],[6,18,6,21]]}
[null,"Subjective Analysis of ","2023-24"," Income and Expenditure Compared to Group and Phase Averages"]
[]
[null,null,null,null,null,null,null,null,"Select a school to Benchmark against",null,null,null,null,"Select a school to Benchmark against",null,null,null,null,"Select a school to Benchmark against"]
[null,null,"Enter last 4 digits of your DfE No.",null,"Number of Places",null,{"$f":"IF(ISERROR(ROUND(VLOOKUP(D4,'2023-24 Data'!A3:G23,7,0),0)),\"\",ROUND(VLOOKUP(D4,'2023-24 Data'!A3:G23,7,0),0))","v":""}]
[null,{"$f":"B1&C1&D1","v":"Subjective Analysis of 2023-24 Income and Expenditure Compared to Group and Phase Averages"}]
[null,null,null,null,null,null,null,null,{"$f":"IF(ISERROR(SUMIF(Schools,I4,dfenums)),\"\",SUMIF(Schools,I4,dfenums))","v":0},{"$f":"IF(ISERROR(ROUND(VLOOKUP(I6,'2023-24 Data'!$A$3:$G$23,7,0),0)),\"\",ROUND(VLOOKUP(I6,'2023-24 Data'!$A$3:$G$23,7,0),0))","v":""},null,null,null,{"$f":"IF(ISERROR(SUMIF(Schools,N4,dfenums)),\"\",SUMIF(Schools,N4,dfenums))","v":0},{"$f":"IF(ISERROR(ROUND(VLOOKUP(N6,'2023-24 Data'!$A$3:$G$23,7,0),0)),\"\",ROUND(VLOOKUP(N6,'2023-24 Data'!$A$3:$G$23,7,0),0))","v":""},null,null,null,{"$f":"IF(ISERROR(SUMIF(Schools,S4,dfenums)),\"\",SUMIF(Schools,S4,dfenums))","v":0},{"$f":"IF(ISERROR(ROUND(VLOOKUP(S6,'2023-24 Data'!$A$3:$G$23,7,0),0)),\"\",ROUND(VLOOKUP(S6,'2023-24 Data'!$A$3:$G$23,7,0),0))","v":""}]
{"$rows_left_out":64}
{"sheet":"2023-24 Data","index":2,"n_rows":73,"n_cols":62,"rows_kept":73,"cut":false,"hidden":true,"merged":[[0,6,0,7],[28,5,48,6],[51,5,71,6]]}
[null,null,"KCC Finance & Procurement","KCC Finance & Procurement","KCC Finance & Procurement","KCC Finance & Procurement","Self generating",null,"Self generating from below"]
["DfE","School","Nursery Places","Nursery Attendance","School Places","School Attendance","Total Places","Total Attendance","E01","E02","E03","E04","E05","E06","E07","E08","E09","E10","E11","E12","E13","E14","E15","E16","E17","E18","E19","E20","E21","E22","E23","E24","E25","E26","E27","E28","E28B","E29","E30","E31","E32","I01","I02","I03","I04","I05","I06","I07","I08","I08b","I09","I10","I11","I12","I13","I15","I16","I17","I18","I18A","I18B","I18C"]
[7002,"Broomhill Bank School",348,0,339.66666666666663,370.5,{"$f":"C3+E3","v":687.66666666666663},{"$f":"D3+F3","v":370.5},{"$f":"IF(Benchmarking!$C$9=\"Yes\",I29-I52,I29)","v":3901835.83},{"$f":"IF(Benchmarking!$C$9=\"Yes\",J29-J52,J29)","v":0},{"$f":"IF(Benchmarking!$C$9=\"Yes\",K29-K52,K29)","v":2436117.08},{"$f":"IF(Benchmarking!$C$9=\"Yes\",L29-L52,L29)","v":215343.78},{"$f":"IF(Benchmarking!$C$9=\"Yes\",M29-M52,M29)","v":736356.39},{"$f":"IF(Benchmarking!$C$9=\"Yes\",N29-N52,N29)","v":112376.01000000001},{"$f":"IF(Benchmarking!$C$9=\"Yes\",O29-O52,O29)","v":357470.28},{"$f":"IF(Benchmarking!$C$9=\"Yes\",P29-P52,P29)","v":49451.82},{"$f":"IF(Benchmarking!$C$9=\"Yes\",Q29-Q52,Q29)","v":10965.42},{"$f":"IF(Benchmarking!$C$9=\"Yes\",R29-R52,R29)","v":704.83},{"$f":"IF(Benchmarking!$C$9=\"Yes\",S29-S52,S29)","v":23013.72},{"$f":"IF(Benchmarking!$C$9=\"Yes\",T29-T52,T29)","v":172389.95},{"$f":"IF(Benchmarking!$C$9=\"Yes\",U29-U52,U29)","v":60873.48},{"$f":"IF(Benchmarking!$C$9=\"Yes\",V29-V52,V29)","v":131898.46},{"$f":"IF(Benchmarking!$C$9=\"Yes\",W29-W52,W29)","v":19684.600000000002},{"$f":"IF(Benchmarking!$C$9=\"Yes\",X29-X52,X29)","v":225245.14},{"$f":"IF(Benchmarking!$C$9=\"Yes\",Y29-Y52,Y29)","v":2080.4499999999998},{"$f":"IF(Benchmarking!$C$9=\"Yes\",Z29-Z52,Z29)","v":36854.79},{"$f":"IF(Benchmarking!$C$9=\"Yes\",AA29-AA52,AA29)","v":391182.65},{"$f":"IF(Benchmarking!$C$9=\"Yes\",AB29-AB52,AB29)","v":194786.92},{"$f":"IF(Benchmarking!$C$9=\"Yes\",AC29-AC52,AC29)","v":26700.25},{"$f":"IF(Benchmarking!$C$9=\"Yes\",AD29-AD52,AD29)","v":60321.68},{"$f":"IF(Benchmarking!$C$9=\"Yes\",AE29-AE52,AE29)","v":15661.380000000001},{"$f":"IF(Benchmarking!$C$9=\"Yes\",AF29-AF52,AF29)","v":22246.78},{"$f":"IF(Benchmarking!$C$9=\"Yes\",AG29-AG52,AG29)","v":207002.23999999999},{"$f":"IF(Benchmarking!$C$9=\"Yes\",AH29-AH52,AH29)","v":99943.49},{"$f":"IF(Benchmarking!$C$9=\"Yes\",AI29-AI52,AI29)","v":378193.15},{"$f":"IF(Benchmarking!$C$9=\"Yes\",AJ29-AJ52,AJ29)","v":144228.99},{"$f":"IF(Benchmarking!$C$9=\"Yes\",AK29-AK52,AK29)","v":0},{"$f":"IF(Benchmarking!$C$9=\"Yes\",AL29-AL52,AL29)","v":48801.8},{"$f":"IF(Benchmarking!$C$9=\"Yes\",AM29-AM52,AM29)","v":128046.36},{"$f":"IF(Benchmarking!$C$9=\"Yes\",AN29-AN52,AN29)","v":0},{"$f":"IF(Benchmarking!$C$9=\"Yes\",AO29-AO52,AO29)","v":0},{"$f":"IF(Benchmarking!$C$9=\"Yes\",AP29-AP52,AP29)","v":-3099772.03},{"$f":"IF(Benchmarking!$C$9=\"Yes\",AQ29-AQ52,AQ29)","v":-1102442.03},{"$f":"IF(Benchmarking!$C$9=\"Yes\",AR29-AR52,AR29)","v":-4815958.49},{"$f":"IF(Benchmarking!$C$9=\"Yes\",AS29-AS52,AS29)","v":0},{"$f":"IF(Benchmarking!$C$9=\"Yes\",AT29-AT52,AT29)","v":-113347.99},{"$f":"IF(Benchmarking!$C$9=\"Yes\",AU29-AU52,AU29)","v":-331964.43},{"$f":"IF(Benchmarking!$C$9=\"Yes\",AV29-AV52,AV29)","v":-509058.3},{"$f":"IF(Benchmarking!$C$9=\"Yes\",AW29-AW52,AW29)","v":0},{"$f":"IF(Benchmarking!$C$9=\"Yes\",AX29-AX52,AX29)","v":-23104.959999999999},{"$f":"IF(Benchmarking!$C$9=\"Yes\",AY29-AY52,AY29)","v":-21101.200000000001},{"$f":"IF(Benchmarking!$C$9=\"Yes\",AZ29-AZ52,AZ29)","v":0},{"$f":"IF(Benchmarking!$C$9=\"Yes\",BA29-BA52,BA29)","v":-12378.75},{"$f":"IF(Benchmarking!$C$9=\"Yes\",BB29-BB52,BB29)","v":-1653},{"$f":"IF(Benchmarking!$C$9=\"Yes\",BC29-BC52,BC29)","v":0},{"$f":"IF(Benchmarking!$C$9=\"Yes\",BD29-BD52,BD29)","v":0},{"$f":"IF(Benchmarking!$C$9=\"Yes\",BE29-BE52,BE29)","v":0},{"$f":"IF(Benchmarking!$C$9=\"Yes\",BF29-BF52,BF29)","v":0},{"$f":"IF(Benchmarking!$C$9=\"Yes\",BG29-BG52,BG29)","v":0},{"$f":"IF(Benchmarking!$C$9=\"Yes\",BH29-BH52,BH29)","v":0},{"$f":"IF(Benchmarking!$C$9=\"Yes\",BI29-BI52,BI29)","v":0},{"$f":"IF(Benchmarking!$C$9=\"Yes\",BJ29-BJ52,BJ29)","v":-158655.69}]
[7021,"Valence School",123,0,110,123.16666666666667,{"$f":"C4+E4","v":233},{"$f":"D4+F4","v":123.16666666666667},{"$f":"IF(Benchmarking!$C$9=\"Yes\",I30-I53,I30)","v":2013536.62},{"$f":"IF(Benchmarking!$C$9=\"Yes\",J30-J53,J30)","v":5292.7300000000005},{"$f":"IF(Benchmarking!$C$9=\"Yes\",K30-K53,K30)","v":3384039.06},{"$f":"IF(Benchmarking!$C$9=\"Yes\",L30-L53,L30)","v":387067.60000000003},{"$f":"IF(Benchmarking!$C$9=\"Yes\",M30-M53,M30)","v":537474.41},{"$f":"IF(Benchmarking!$C$9=\"Yes\",N30-N53,N30)","v":88336.02},{"$f":"IF(Benchmarking!$C$9=\"Yes\",O30-O53,O30)","v":678733.91},{"$f":"IF(Benchmarking!$C$9=\"Yes\",P30-P53,P30)","v":69354.73},{"$f":"IF(Benchmarking!$C$9=\"Yes\",Q30-Q53,Q30)","v":28911.4},{"$f":"IF(Benchmarking!$C$9=\"Yes\",R30-R53,R30)","v":220},{"$f":"IF(Benchmarking!$C$9=\"Yes\",S30-S53,S30)","v":7790.76},{"$f":"IF(Benchmarking!$C$9=\"Yes\",T30-T53,T30)","v":60029.53},{"$f":"IF(Benchmarking!$C$9=\"Yes\",U30-U53,U30)","v":10770.050000000001},{"$f":"IF(Benchmarking!$C$9=\"Yes\",V30-V53,V30)","v":32447.61},{"$f":"IF(Benchmarking!$C$9=\"Yes\",W30-W53,W30)","v":18180.37},{"$f":"IF(Benchmarking!$C$9=\"Yes\",X30-X53,X30)","v":350862.15},{"$f":"IF(Benchmarking!$C$9=\"Yes\",Y30-Y53,Y30)","v":1743.42},{"$f":"IF(Benchmarking!$C$9=\"Yes\",Z30-Z53,Z30)","v":52202.090000000004},{"$f":"IF(Benchmarking!$C$9=\"Yes\",AA30-AA53,AA30)","v":47370.11},{"$f":"IF(Benchmarking!$C$9=\"Yes\",AB30-AB53,AB30)","v":87187.28},{"$f":"IF(Benchmarking!$C$9=\"Yes\",AC30-AC53,AC30)","v":5872.6},{"$f":"IF(Benchmarking!$C$9=\"Yes\",AD30-AD53,AD30)","v":201568.44},{"$f":"IF(Benchmarking!$C$9=\"Yes\",AE30-AE53,AE30)","v":6667.9000000000005},{"$f":"IF(Benchmarking!$C$9=\"Yes\",AF30-AF53,AF30)","v":12623.75},{"$f":"IF(Benchmarking!$C$9=\"Yes\",AG30-AG53,AG30)","v":102778},{"$f":"IF(Benchmarking!$C$9=\"Yes\",AH30-AH53,AH30)","v":0},{"$f":"IF(Benchmarking!$C$9=\"Yes\",AI30-AI53,AI30)","v":497190.37},{"$f":"IF(Benchmarking!$C$9=\"Yes\",AJ30-AJ53,AJ30)","v":83839.19},{"$f":"IF(Benchmarking!$C$9=\"Yes\",AK30-AK53,AK30)","v":0},{"$f":"IF(Benchmarking!$C$9=\"Yes\",AL30-AL53,AL30)","v":0},{"$f":"IF(Benchmarking!$C$9=\"Yes\",AM30-AM53,AM30)","v":1421.02},{"$f":"IF(Benchmarking!$C$9=\"Yes\",AN30-AN53,AN30)","v":0},{"$f":"IF(Benchmarking!$C$9=\"Yes\",AO30-AO53,AO30)","v":49434.04},{"$f":"IF(Benchmarking!$C$9=\"Yes\",AP30-AP53,AP30)","v":-1073760.1100000001},{"$f":"IF(Benchmarking!$C$9=\"Yes\",AQ30-AQ53,AQ30)","v":-304655.87},{"$f":"IF(Benchmarking!$C$9=\"Yes\",AR30-AR53,AR30)","v":-4853694.3100000005},{"$f":"IF(Benchmarking!$C$9=\"Yes\",AS30-AS53,AS30)","v":0},{"$f":"IF(Benchmarking!$C$9=\"Yes\",AT30-AT53,AT30)","v":-30910},{"$f":"IF(Benchmarking!$C$9=\"Yes\",AU30-AU53,AU30)","v":-267703.67999999999},{"$f":"IF(Benchmarking!$C$9=\"Yes\",AV30-AV53,AV30)","v":-1301867.02},{"$f":"IF(Benchmarking!$C$9=\"Yes\",AW30-AW53,AW30)","v":-9741.7000000000007},{"$f":"IF(Benchmarking!$C$9=\"Yes\",AX30-AX53,AX30)","v":-317537.95},{"$f":"IF(Benchmarking!$C$9=\"Yes\",AY30-AY53,AY30)","v":-19177.66},{"$f":"IF(Benchmarking!$C$9=\"Yes\",AZ30-AZ53,AZ30)","v":0},{"$f":"IF(Benchmarking!$C$9=\"Yes\",BA30-BA53,BA30)","v":0},{"$f":"IF(Benchmarking!$C$9=\"Yes\",BB30-BB53,BB30)","v":-93.5},{"$f":"IF(Benchmarking!$C$9=\"Yes\",BC30-BC53,BC30)","v":-14520.87},{"$f":"IF(Benchmarking!$C$9=\"Yes\",BD30-BD53,BD30)","v":0},{"$f":"IF(Benchmarking!$C$9=\"Yes\",BE30-BE53,BE30)","v":0},{"$f":"IF(Benchmarking!$C$9=\"Yes\",BF30-BF53,BF30)","v":-50000},{"$f":"IF(Benchmarking!$C$9=\"Yes\",BG30-BG53,BG30)","v":-18801},{"$f":"IF(Benchmarking!$C$9=\"Yes\",BH30-BH53,BH30)","v":0},{"$f":"IF(Benchmarking!$C$9=\"Yes\",BI30-BI53,BI30)","v":0},{"$f":"IF(Benchmarking!$C$9=\"Yes\",BJ30-BJ53,BJ30)","v":-31296.79}]
[7032,"Bower Grove School",240,0,225,238.75,465,238.75,{"$f":"IF(Benchmarking!$C$9=\"Yes\",I31-I54,I31)","v":2226362.7799999998},{"$f":"IF(Benchmarking!$C$9=\"Yes\",J31-J54,J31)","v":21854},{"$f":"IF(Benchmarking!$C$9=\"Yes\",K31-K54,K31)","v":2045441.61},{"$f":"IF(Benchmarking!$C$9=\"Yes\",L31-L54,L31)","v":84844.03},{"$f":"IF(Benchmarking!$C$9=\"Yes\",M31-M54,M31)","v":287671.16000000003},{"$f":"IF(Benchmarking!$C$9=\"Yes\",N31-N54,N31)","v":51681.47},{"$f":"IF(Benchmarking!$C$9=\"Yes\",O31-O54,O31)","v":494.22},{"$f":"IF(Benchmarking!$C$9=\"Yes\",P31-P54,P31)","v":29820.09},{"$f":"IF(Benchmarking!$C$9=\"Yes\",Q31-Q54,Q31)","v":26156.34},{"$f":"IF(Benchmarking!$C$9=\"Yes\",R31-R54,R31)","v":450},{"$f":"IF(Benchmarking!$C$9=\"Yes\",S31-S54,S31)","v":20884.439999999999},{"$f":"IF(Benchmarking!$C$9=\"Yes\",T31-T54,T31)","v":103651.76000000001},{"$f":"IF(Benchmarking!$C$9=\"Yes\",U31-U54,U31)","v":25912.760000000002},{"$f":"IF(Benchmarking!$C$9=\"Yes\",V31-V54,V31)","v":84037.92},{"$f":"IF(Benchmarking!$C$9=\"Yes\",W31-W54,W31)","v":24114.29},{"$f":"IF(Benchmarking!$C$9=\"Yes\",X31-X54,X31)","v":84934.05},{"$f":"IF(Benchmarking!$C$9=\"Yes\",Y31-Y54,Y31)","v":0},{"$f":"IF(Benchmarking!$C$9=\"Yes\",Z31-Z54,Z31)","v":81511.47},{"$f":"IF(Benchmarking!$C$9=\"Yes\",AA31-AA54,AA31)","v":100975.41},{"$f":"IF(Benchmarking!$C$9=\"Yes\",AB31-AB54,AB31)","v":109913.1},{"$f":"IF(Benchmarking!$C$9=\"Yes\",AC31-AC54,AC31)","v":9235.67},{"$f":"IF(Benchmarking!$C$9=\"Yes\",AD31-AD54,AD31)","v":56418.06},{"$f":"IF(Benchmarking!$C$9=\"Yes\",AE31-AE54,AE31)","v":10165.65},{"$f":"IF(Benchmarking!$C$9=\"Yes\",AF31-AF54,AF31)","v":51252.520000000004},{"$f":"IF(Benchmarking!$C$9=\"Yes\",AG31-AG54,AG31)","v":56993.36},{"$f":"IF(Benchmarking!$C$9=\"Yes\",AH31-AH54,AH31)","v":850},{"$f":"IF(Benchmarking!$C$9=\"Yes\",AI31-AI54,AI31)","v":192778.6},{"$f":"IF(Benchmarking!$C$9=\"Yes\",AJ31-AJ54,AJ31)","v":34297.090000000004},{"$f":"IF(Benchmarking!$C$9=\"Yes\",AK31-AK54,AK31)","v":0},{"$f":"IF(Benchmarking!$C$9=\"Yes\",AL31-AL54,AL31)","v":0},{"$f":"IF(Benchmarking!$C$9=\"Yes\",AM31-AM54,AM31)","v":65891.199999999997},{"$f":"IF(Benchmarking!$C$9=\"Yes\",AN31-AN54,AN31)","v":0},{"$f":"IF(Benchmarking!$C$9=\"Yes\",AO31-AO54,AO31)","v":0},{"$f":"IF(Benchmarking!$C$9=\"Yes\",AP31-AP54,AP31)","v":-2613274.36},{"$f":"IF(Benchmarking!$C$9=\"Yes\",AQ31-AQ54,AQ31)","v":0},{"$f":"IF(Benchmarking!$C$9=\"Yes\",AR31-AR54,AR31)","v":-2277313.85},{"$f":"IF(Benchmarking!$C$9=\"Yes\",AS31-AS54,AS31)","v":0},{"$f":"IF(Benchmarking!$C$9=\"Yes\",AT31-AT54,AT31)","v":-230522},{"$f":"IF(Benchmarking!$C$9=\"Yes\",AU31-AU54,AU31)","v":-64650.270000000004},{"$f":"IF(Benchmarking!$C$9=\"Yes\",AV31-AV54,AV31)","v":-12365.14},{"$f":"IF(Benchmarking!$C$9=\"Yes\",AW31-AW54,AW31)","v":-9255.07},{"$f":"IF(Benchmarking!$C$9=\"Yes\",AX31-AX54,AX31)","v":-275948.22000000003},{"$f":"IF(Benchmarking!$C$9=\"Yes\",AY31-AY54,AY31)","v":-12689.050000000001},{"$f":"IF(Benchmarking!$C$9=\"Yes\",AZ31-AZ54,AZ31)","v":0},{"$f":"IF(Benchmarking!$C$9=\"Yes\",BA31-BA54,BA31)","v":-13525.45},{"$f":"IF(Benchmarking!$C$9=\"Yes\",BB31-BB54,BB31)","v":-20839.400000000001},{"$f":"IF(Benchmarking!$C$9=\"Yes\",BC31-BC54,BC31)","v":-55589.380000000005},{"$f":"IF(Benchmarking!$C$9=\"Yes\",BD31-BD54,BD31)","v":0},{"$f":"IF(Benchmarking!$C$9=\"Yes\",BE31-BE54,BE31)","v":0},{"$f":"IF(Benchmarking!$C$9=\"Yes\",BF31-BF54,BF31)","v":0},{"$f":"IF(Benchmarking!$C$9=\"Yes\",BG31-BG54,BG31)","v":-17554},{"$f":"IF(Benchmarking!$C$9=\"Yes\",BH31-BH54,BH31)","v":0},{"$f":"IF(Benchmarking!$C$9=\"Yes\",BI31-BI54,BI31)","v":0},{"$f":"IF(Benchmarking!$C$9=\"Yes\",BJ31-BJ54,BJ31)","v":-147153.17000000001}]
[7033,"St Anthony's School",103,0,108.66666666666666,105.08333333333333,211.66666666666666,105.08333333333333,{"$f":"IF(Benchmarking!$C$9=\"Yes\",I32-I55,I32)","v":1330176.06},{"$f":"IF(Benchmarking!$C$9=\"Yes\",J32-J55,J32)","v":0},{"$f":"IF(Benchmarking!$C$9=\"Yes\",K32-K55,K32)","v":641460.05000000005},{"$f":"IF(Benchmarking!$C$9=\"Yes\",L32-L55,L32)","v":39194.639999999999},{"$f":"IF(Benchmarking!$C$9=\"Yes\",M32-M55,M32)","v":197966.6},{"$f":"IF(Benchmarking!$C$9=\"Yes\",N32-N55,N32)","v":43362.85},{"$f":"IF(Benchmarking!$C$9=\"Yes\",O32-O55,O32)","v":48993.91},{"$f":"IF(Benchmarking!$C$9=\"Yes\",P32-P55,P32)","v":915.45},{"$f":"IF(Benchmarking!$C$9=\"Yes\",Q32-Q55,Q32)","v":8330.0499999999993},{"$f":"IF(Benchmarking!$C$9=\"Yes\",R32-R55,R32)","v":215.33},{"$f":"IF(Benchmarking!$C$9=\"Yes\",S32-S55,S32)","v":9741},{"$f":"IF(Benchmarking!$C$9=\"Yes\",T32-T55,T32)","v":51816.32},{"$f":"IF(Benchmarking!$C$9=\"Yes\",U32-U55,U32)","v":5377.62},{"$f":"IF(Benchmarking!$C$9=\"Yes\",V32-V55,V32)","v":53120.81},{"$f":"IF(Benchmarking!$C$9=\"Yes\",W32-W55,W32)","v":4604.78},{"$f":"IF(Benchmarking!$C$9=\"Yes\",X32-X55,X32)","v":47556.92},{"$f":"IF(Benchmarking!$C$9=\"Yes\",Y32-Y55,Y32)","v":0},{"$f":"IF(Benchmarking!$C$9=\"Yes\",Z32-Z55,Z32)","v":9056.24},{"$f":"IF(Benchmarking!$C$9=\"Yes\",AA32-AA55,AA32)","v":78597.03},{"$f":"IF(Benchmarking!$C$9=\"Yes\",AB32-AB55,AB32)","v":33475.090000000004},{"$f":"IF(Benchmarking!$C$9=\"Yes\",AC32-AC55,AC32)","v":5381.41},{"$f":"IF(Benchmarking!$C$9=\"Yes\",AD32-AD55,AD32)","v":6122.96},{"$f":"IF(Benchmarking!$C$9=\"Yes\",AE32-AE55,AE32)","v":5500.74},{"$f":"IF(Benchmarking!$C$9=\"Yes\",AF32-AF55,AF32)","v":12376.79},{"$f":"IF(Benchmarking!$C$9=\"Yes\",AG32-AG55,AG32)","v":35428.160000000003},{"$f":"IF(Benchmarking!$C$9=\"Yes\",AH32-AH55,AH32)","v":67563.86},{"$f":"IF(Benchmarking!$C$9=\"Yes\",AI32-AI55,AI32)","v":122327.69},{"$f":"IF(Benchmarking!$C$9=\"Yes\",AJ32-AJ55,AJ32)","v":30708.91},{"$f":"IF(Benchmarking!$C$9=\"Yes\",AK32-AK55,AK32)","v":0},{"$f":"IF(Benchmarking!$C$9=\"Yes\",AL32-AL55,AL32)","v":0},{"$f":"IF(Benchmarking!$C$9=\"Yes\",AM32-AM55,AM32)","v":215200.75},{"$f":"IF(Benchmarking!$C$9=\"Yes\",AN32-AN55,AN32)","v":0},{"$f":"IF(Benchmarking!$C$9=\"Yes\",AO32-AO55,AO32)","v":0},{"$f":"IF(Benchmarking!$C$9=\"Yes\",AP32-AP55,AP32)","v":-1197176.48},{"$f":"IF(Benchmarking!$C$9=\"Yes\",AQ32-AQ55,AQ32)","v":0},{"$f":"IF(Benchmarking!$C$9=\"Yes\",AR32-AR55,AR32)","v":-1279644.5},{"$f":"IF(Benchmarking!$C$9=\"Yes\",AS32-AS55,AS32)","v":0},{"$f":"IF(Benchmarking!$C$9=\"Yes\",AT32-AT55,AT32)","v":-107716.5},{"$f":"IF(Benchmarking!$C$9=\"Yes\",AU32-AU55,AU32)","v":-28192.420000000002},{"$f":"IF(Benchmarking!$C$9=\"Yes\",AV32-AV55,AV32)","v":-99653.16},{"$f":"IF(Benchmarking!$C$9=\"Yes\",AW32-AW55,AW32)","v":-12425},{"$f":"IF(Benchmarking!$C$9=\"Yes\",AX32-AX55,AX32)","v":-1768.29},{"$f":"IF(Benchmarking!$C$9=\"Yes\",AY32-AY55,AY32)","v":-4681.5600000000004},{"$f":"IF(Benchmarking!$C$9=\"Yes\",AZ32-AZ55,AZ32)","v":-8079.2},{"$f":"IF(Benchmarking!$C$9=\"Yes\",BA32-BA55,BA32)","v":0},{"$f":"IF(Benchmarking!$C$9=\"Yes\",BB32-BB55,BB32)","v":-777.65},{"$f":"IF(Benchmarking!$C$9=\"Yes\",BC32-BC55,BC32)","v":-2597.4299999999998},{"$f":"IF(Benchmarking!$C$9=\"Yes\",BD32-BD55,BD32)","v":0},{"$f":"IF(Benchmarking!$C$9=\"Yes\",BE32-BE55,BE32)","v":0},{"$f":"IF(Benchmarking!$C$9=\"Yes\",BF32-BF55,BF32)","v":0},{"$f":"IF(Benchmarking!$C$9=\"Yes\",BG32-BG55,BG32)","v":-16343},{"$f":"IF(Benchmarking!$C$9=\"Yes\",BH32-BH55,BH32)","v":0},{"$f":"IF(Benchmarking!$C$9=\"Yes\",BI32-BI55,BI32)","v":0},{"$f":"IF(Benchmarking!$C$9=\"Yes\",BJ32-BJ55,BJ32)","v":-68923}]
{"$rows_left_out":67}