{"text_format":"1","workbook":"xlsx","n_sheets":4,"sheets":["Data","Header","Early Years","Child Detail"],"not_rendered":{"charts":0,"images":1,"macros":1,"external_links":0,"defined_names":4,"comments":2,"pivot_tables":0},"unopened":[],"bounds":{"document_bytes":16777216,"sheet_cells":100000,"rows_first":2000,"rows_last":500,"rows_between":2000,"halvings":0,"cell_chars":16384,"cell_head_chars":4096},"cells_cut":0,"cells_raw":0,"read":"whole","date_system":"1900"}

{"sheet":"Data","index":0,"n_rows":4,"n_cols":19,"rows_kept":4,"cut":false,"hidden":true,"merged":[[0,1,0,3],[0,4,0,15],[0,16,0,18]]}
["Lists","Terms",null,null,"Months",null,null,null,null,null,null,null,null,null,null,null,"Weeks"]
[null,"Summer","Autumn","Spring","April","May","June","July","August","September","October","November","December","January","February","March",13,14,11]
[null,"Autumn","Spring","Summer","September","October","November","December","January","February","March","April","May","June","July","August",14,11,13]
[null,"Spring","Summer","Autumn","January","February","March","April","May","June","July","August","September","October","November","December",11,13,14]

{"sheet":"Header","index":1,"n_rows":17,"n_cols":5,"rows_kept":17,"cut":false,"hidden":false,"merged":[[3,2,3,7]]}
[]
[]
[null,"URN"]
[null,"Setting Name"]
[]
[]
[null,"First Term","Autumn"]
[]
[null,null,{"$f":"C7","v":"Autumn"},{"$f":"VLOOKUP($C$7,Data!$B$2:$C$4,2,0)","v":"Spring"},{"$f":"VLOOKUP($C$7,Data!$B$2:$D$4,3,0)","v":"Summer"}]
[null,"Stretched weeks"]
[]
[null,"Hourly Rate",{"$f":"C9","v":"Autumn"},{"$f":"D9","v":"Spring"},"Summer"]
[null,"3&4's Base rate"]
[null,"3&4's Quality (Qualified Leader) supplement"]
[null,"3&4's Disadvantage supplement"]
[null,"Free for Two"]
[null,"Early Years Pupil Premium (EYPP)"]

{"sheet":"Early Years","index":2,"n_rows":113,"n_cols":10,"rows_kept":113,"cut":false,"hidden":false,"merged":[[112,1,112,4],[3,0,3,5],[26,7,26,9],[53,7,53,9],[80,7,80,9],[110,1,110,4],[80,2,80,4],[53,2,53,4],[26,2,26,4],[8,1,8,5],[7,1,7,5]]}
[]
[]
[]
["Early Years Budget Estimation"]
[]
[null,null,null,null,"URN:",{"$f":"Header!C3","v":0}]
[]
[null,{"$f":"Header!C4","v":0}]
[null,"Summary Funding Table"]
[null,null,{"$f":"Header!C9","v":"Autumn"},{"$f":"Header!D9","v":"Spring"},{"$f":"Header!E9","v":"Summer"},"Total"]
[null,"3 & 4 Year old funding",{"$f":"C49+H49","v":0},{"$f":"D49+I49","v":0},0,{"$f":"SUM(C11:E11)","v":0}]
[null,"2 Year old funding",{"$f":"C76+H76","v":0},{"$f":"D76+I76","v":0},0,0]
[null,"Early Years Pupil Premium (EYPP)",{"$f":"C103+H103","v":0},{"$f":"D103+I103","v":0},0,0]
[null,"Special Educational Needs Inclusion Fund (SENIF)",{"$f":"C108","v":0},{"$f":"D108","v":0},0,0]
[null,"Disability Access Fund (DAF)",{"$f":"C109","v":0},0,0,0]
[null,"Total Funding",{"$f":"SUM(C11:C15)","v":0},{"$f":"SUM(D11:D15)","v":0},0,0]
[]
[]
[null,"3 & 4 Year old funding"]
[]
{"$rows_left_out":94}
{"sheet":"Child Detail","index":3,"n_rows":100,"n_cols":62,"rows_kept":100,"cut":false,"hidden":false,"merged":[[5,47,5,51],[5,53,5,57],[5,41,5,45]]}
[]
[null,null,null,null,null,"Early Years Budget Estimation"]
[null,null,null,null,null,{"$f":"Header!C3","v":0},{"$f":"Header!C4","v":0}]
[]
[null,null,null,null,null,null,null,null,null,null,null,null,null,null,null,null,null,null,null,null,null,null,null,null,null,null,null,null,null,null,null,null,null,null,null,null,null,null,null,null,null,"*FF2 & EYPP is only funded up to the maximum of 15 hours",null,null,null,null,null,"*FF2 & EYPP is only funded up to the maximum of 15 hours",null,null,null,null,null,"*FF2 & EYPP is only funded up to the maximum of 15 hours"]
[null,null,null,null,null,null,null,null,null,null,null,null,null,null,null,null,null,null,null,null,null,null,null,null,null,null,null,null,null,null,null,null,null,null,null,null,null,null,null,null,null,{"$f":"Header!C9&\" Term Funding\"","v":"Autumn Term Funding"},null,null,null,null,null,{"$f":"Header!D9&\" Term Funding\"","v":"Spring Term Funding"},null,null,null,null,null,{"$f":"Header!E9&\" Term Funding\"","v":"Summer Term Funding"}]
[null,"Child's Name",{"$f":"\"Weeks Funded for \"&Header!C9&\" Term\"","v":"Weeks Funded for Autumn Term"},{"$f":"\"Weeks Funded for \"&Header!D9&\" Term\"","v":"Weeks Funded for Spring Term"},{"$f":"\"Weeks Funded for \"&Header!E9&\" Term\"","v":"Weeks Funded for Summer Term"},"3 & 4 Year old funding weekly hours","2 Year old funding weekly hours","Early Years Pupil Premium (EYPP)","Monthly Special Educational Needs Inclusion Fund (SENIF)","SENIF Funding Start Month","SENIF Funding Stop Month","Disability Access Fund (DAF)",null,{"$f":"VLOOKUP(Header!$C$7,Data!$B$2:$P$4,4,0)","v":"September"},{"$f":"VLOOKUP(Header!$C$7,Data!$B$2:$P$4,5,0)","v":"October"},{"$f":"VLOOKUP(Header!$C$7,Data!$B$2:$P$4,6,0)","v":"November"},{"$f":"VLOOKUP(Header!$C$7,Data!$B$2:$P$4,7,0)","v":"December"},{"$f":"VLOOKUP(Header!$C$7,Data!$B$2:$P$4,8,0)","v":"January"},{"$f":"VLOOKUP(Header!$C$7,Data!$B$2:$P$4,9,0)","v":"February"},{"$f":"VLOOKUP(Header!$C$7,Data!$B$2:$P$4,10,0)","v":"March"},{"$f":"VLOOKUP(Header!$C$7,Data!$B$2:$P$4,11,0)","v":"April"},{"$f":"VLOOKUP(Header!$C$7,Data!$B$2:$P$4,12,0)","v":"May"},{"$f":"VLOOKUP(Header!$C$7,Data!$B$2:$P$4,13,0)","v":"June"},{"$f":"VLOOKUP(Header!$C$7,Data!$B$2:$P$4,14,0)","v":"July"},{"$f":"VLOOKUP(Header!$C$7,Data!$B$2:$P$4,15,0)","v":"August"},"DAF","Total Funding",null,{"$f":"N7","v":"September"},{"$f":"O7","v":"October"},"November","December","January","February","March","April","May","June","July","August",null,"3&4\nFunding","FF2\nFunding","EYPP\nFunding","SENIF Funding","Total\nFunding",null,"3&4\nFunding","FF2\nFunding","EYPP\nFunding","SENIF Funding","Total\nFunding",null,"3&4\nFunding","FF2\nFunding","EYPP\nFunding","SENIF Funding","Total\nFunding",null,"DAF",null,"Total Funding"]
[null,"A",14,11,13,15,null,"YES",100,"January","July","YES",null,{"$f":"IF(N$7=\"April\",SUM($AP8:$AR8)/5,IF(N$7=\"September\",SUM($AP8:$AR8)/4,SUM($AP8:$AR8)/3))+(AC8*$I8)","v":0},{"$f":"IF(O$7=\"May\",SUM($AP8:$AR8)/5,IF(O$7=\"October\",SUM($AP8:$AR8)/4,SUM($AP8:$AR8)/3))+(AD8*$I8)","v":0},{"$f":"IF(P$7=\"June\",SUM($AP8:$AR8)/5,IF(P$7=\"November\",SUM($AP8:$AR8)/4,SUM($AP8:$AR8)/3))+(AE8*$I8)","v":0},{"$f":"IF(Q$7=\"July\",SUM($AP8:$AR8)/5,IF(Q$7=\"December\",SUM($AP8:$AR8)/4,SUM($AV8:$AX8)/5))+(AF8*$I8)","v":0},{"$f":"IF(R$7=\"August\",SUM($AP8:$AR8)/5,IF(R$7=\"January\",SUM($AV8:$AX8)/3,SUM($AV8:$AX8)/5))+(AG8*$I8)","v":100},{"$f":"IF(S$7=\"September\",SUM($AV8:$AX8)/4,IF(S$7=\"February\",SUM($AV8:$AX8)/3,SUM($AV8:$AX8)/5))+(AH8*$I8)","v":100},{"$f":"IF(T$7=\"October\",SUM($AV8:$AX8)/4,IF(T$7=\"March\",SUM($AV8:$AX8)/3,SUM($AV8:$AX8)/5))+(AI8*$I8)","v":100},{"$f":"IF(U$7=\"November\",SUM($AV8:$AX8)/4,IF(U$7=\"April\",SUM($BB8:$BD8)/5,SUM($AV8:$AX8)/5))+(AJ8*$I8)","v":100},{"$f":"IF(V$7=\"December\",SUM($AV8:$AX8)/4,IF(V$7=\"May\",SUM($BB8:$BD8)/5,SUM($BB8:$BD8)/4))+(AK8*$I8)","v":100},{"$f":"IF(W$7=\"January\",SUM($BB8:$BD8)/3,IF(W$7=\"June\",SUM($BB8:$BD8)/5,SUM($BB8:$BD8)/4))+(AL8*$I8)","v":100},{"$f":"IF(X$7=\"February\",SUM($BB8:$BD8)/3,IF(X$7=\"July\",SUM($BB8:$BD8)/5,SUM($BB8:$BD8)/4))+(AM8*$I8)","v":100},{"$f":"IF(Y$7=\"March\",SUM($BB8:$BD8)/3,IF(Y$7=\"August\",SUM($BB8:$BD8)/5,SUM($BB8:$BD8)/4))+(AN8*$I8)","v":0},{"$f":"BH8","v":615},{"$f":"SUM(N8:Z8)","v":1315},null,{"$f":"IF(AC$7=$J8,1,0)","v":0},{"$f":"IF(AC8=1,IF(AC$7=$K8,0,1),IF(AD$7=$J8,1,0))","v":0},{"$f":"IF(AD8=1,IF(AD$7=$K8,0,1),IF(AE$7=$J8,1,0))","v":0},0,1,1,1,1,1,1,1,0,null,{"$f":"$C8*$F8*SUM(Header!$C$13:$C$15)","v":0},{"$f":"IF($G8>15,15,$G8)*$C8*Header!$C$16","v":0},{"$f":"IF($F8>15,15,$F8)*$C8*Header!$C$17","v":0},{"$f":"IF(Header!$C$12=\"Summer\",SUM($AC8:$AG8),IF(Header!$C$12=\"Autumn\",SUM($AC8:$AF8),IF(Header!$C$12=\"Spring\",SUM($AC8:$AE8),0)))*$I8","v":0},{"$f":"SUM(AP8:AS8)","v":0},null,{"$f":"$D8*$F8*SUM(Header!$D$13:$D$15)","v":0},{"$f":"IF($G8>15,15,$G8)*$D8*Header!$D$16","v":0},{"$f":"IF($F8>15,15,$F8)*$D8*Header!$D$17","v":0},{"$f":"IF(Header!$C$12=\"Summer\",SUM($AH8:$AK8),IF(Header!$C$12=\"Autumn\",SUM($AG8:$AI8),IF(Header!$C$12=\"Spring\",SUM($AF8:$AJ8),0)))*$I8","v":300},{"$f":"SUM(AV8:AY8)","v":300},null,{"$f":"$E8*$F8*SUM(Header!$E$13:$E$15)","v":0},{"$f":"IF($G8>15,15,$G8)*$E8*Header!$E$16","v":0},{"$f":"IF($F8>15,15,$F8)*$E8*Header!$E$17","v":0},{"$f":"IF(Header!$C$12=\"Summer\",SUM($AL8:$AN8),IF(Header!$C$12=\"Autumn\",SUM($AJ8:$AN8),IF(Header!$C$12=\"Spring\",SUM($AK8:$AN8),0)))*$I8","v":400},{"$f":"SUM(BB8:BE8)","v":400},null,{"$f":"IF(L8=\"YES\",615,0)","v":615},null,{"$f":"AT8+AZ8+BF8+BH8","v":1315}]
[null,"B",14,11,13,null,15,"YES",100,"April","September","YES",null,{"$f":"IF(N$7=\"April\",SUM($AP9:$AR9)/5,IF(N$7=\"September\",SUM($AP9:$AR9)/4,SUM($AP9:$AR9)/3))+(AC9*$I9)","v":0},{"$f":"IF(O$7=\"May\",SUM($AP9:$AR9)/5,IF(O$7=\"October\",SUM($AP9:$AR9)/4,SUM($AP9:$AR9)/3))+(AD9*$I9)","v":0},{"$f":"IF(P$7=\"June\",SUM($AP9:$AR9)/5,IF(P$7=\"November\",SUM($AP9:$AR9)/4,SUM($AP9:$AR9)/3))+(AE9*$I9)","v":0},{"$f":"IF(Q$7=\"July\",SUM($AP9:$AR9)/5,IF(Q$7=\"December\",SUM($AP9:$AR9)/4,SUM($AV9:$AX9)/5))+(AF9*$I9)","v":0},{"$f":"IF(R$7=\"August\",SUM($AP9:$AR9)/5,IF(R$7=\"January\",SUM($AV9:$AX9)/3,SUM($AV9:$AX9)/5))+(AG9*$I9)","v":0},{"$f":"IF(S$7=\"September\",SUM($AV9:$AX9)/4,IF(S$7=\"February\",SUM($AV9:$AX9)/3,SUM($AV9:$AX9)/5))+(AH9*$I9)","v":0},{"$f":"IF(T$7=\"October\",SUM($AV9:$AX9)/4,IF(T$7=\"March\",SUM($AV9:$AX9)/3,SUM($AV9:$AX9)/5))+(AI9*$I9)","v":0},{"$f":"IF(U$7=\"November\",SUM($AV9:$AX9)/4,IF(U$7=\"April\",SUM($BB9:$BD9)/5,SUM($AV9:$AX9)/5))+(AJ9*$I9)","v":100},{"$f":"IF(V$7=\"December\",SUM($AV9:$AX9)/4,IF(V$7=\"May\",SUM($BB9:$BD9)/5,SUM($BB9:$BD9)/4))+(AK9*$I9)","v":100},{"$f":"IF(W$7=\"January\",SUM($BB9:$BD9)/3,IF(W$7=\"June\",SUM($BB9:$BD9)/5,SUM($BB9:$BD9)/4))+(AL9*$I9)","v":100},{"$f":"IF(X$7=\"February\",SUM($BB9:$BD9)/3,IF(X$7=\"July\",SUM($BB9:$BD9)/5,SUM($BB9:$BD9)/4))+(AM9*$I9)","v":100},{"$f":"IF(Y$7=\"March\",SUM($BB9:$BD9)/3,IF(Y$7=\"August\",SUM($BB9:$BD9)/5,SUM($BB9:$BD9)/4))+(AN9*$I9)","v":100},{"$f":"BH9","v":615},{"$f":"SUM(N9:Z9)","v":1115},null,{"$f":"IF(AC$7=$J9,1,0)","v":0},{"$f":"IF(AC9=1,IF(AC$7=$K9,0,1),IF(AD$7=$J9,1,0))","v":0},0,0,0,0,0,1,1,1,1,1,null,{"$f":"$C9*$F9*SUM(Header!$C$13:$C$15)","v":0},{"$f":"IF($G9>15,15,$G9)*$C9*Header!$C$16","v":0},{"$f":"IF($F9>15,15,$F9)*$C9*Header!$C$17","v":0},{"$f":"IF(Header!$C$12=\"Summer\",SUM($AC9:$AG9),IF(Header!$C$12=\"Autumn\",SUM($AC9:$AF9),IF(Header!$C$12=\"Spring\",SUM($AC9:$AE9),0)))*$I9","v":0},{"$f":"SUM(AP9:AS9)","v":0},null,{"$f":"$D9*$F9*SUM(Header!$D$13:$D$15)","v":0},{"$f":"IF($G9>15,15,$G9)*$D9*Header!$D$16","v":0},{"$f":"IF($F9>15,15,$F9)*$D9*Header!$D$17","v":0},{"$f":"IF(Header!$C$12=\"Summer\",SUM($AH9:$AK9),IF(Header!$C$12=\"Autumn\",SUM($AG9:$AI9),IF(Header!$C$12=\"Spring\",SUM($AF9:$AJ9),0)))*$I9","v":0},{"$f":"SUM(AV9:AY9)","v":0},null,{"$f":"$E9*$F9*SUM(Header!$E$13:$E$15)","v":0},{"$f":"IF($G9>15,15,$G9)*$E9*Header!$E$16","v":0},{"$f":"IF($F9>15,15,$F9)*$E9*Header!$E$17","v":0},{"$f":"IF(Header!$C$12=\"Summer\",SUM($AL9:$AN9),IF(Header!$C$12=\"Autumn\",SUM($AJ9:$AN9),IF(Header!$C$12=\"Spring\",SUM($AK9:$AN9),0)))*$I9","v":500},{"$f":"SUM(BB9:BE9)","v":500},null,{"$f":"IF(L9=\"YES\",615,0)","v":615},null,{"$f":"AT9+AZ9+BF9+BH9","v":1115}]
[null,null,null,null,null,null,null,null,null,null,null,null,null,0,0,0,0,0,0,0,0,0,0,0,0,0,0,null,0,{"$f":"IF(AC10=1,IF(AC$7=$K10,0,1),IF(AD$7=$J10,1,0))","v":0},0,0,0,0,0,0,0,0,0,0,null,{"$f":"$C10*$F10*SUM(Header!$C$13:$C$15)","v":0},{"$f":"IF($G10>15,15,$G10)*$C10*Header!$C$16","v":0},{"$f":"IF($F10>15,15,$F10)*$C10*Header!$C$17","v":0},{"$f":"IF(Header!$C$12=\"Summer\",SUM($AC10:$AG10),IF(Header!$C$12=\"Autumn\",SUM($AC10:$AF10),IF(Header!$C$12=\"Spring\",SUM($AC10:$AE10),0)))*$I10","v":0},0,null,{"$f":"$D10*$F10*SUM(Header!$D$13:$D$15)","v":0},{"$f":"IF($G10>15,15,$G10)*$D10*Header!$D$16","v":0},{"$f":"IF($F10>15,15,$F10)*$D10*Header!$D$17","v":0},{"$f":"IF(Header!$C$12=\"Summer\",SUM($AH10:$AK10),IF(Header!$C$12=\"Autumn\",SUM($AG10:$AI10),IF(Header!$C$12=\"Spring\",SUM($AF10:$AJ10),0)))*$I10","v":0},0,null,{"$f":"$E10*$F10*SUM(Header!$E$13:$E$15)","v":0},{"$f":"IF($G10>15,15,$G10)*$E10*Header!$E$16","v":0},{"$f":"IF($F10>15,15,$F10)*$E10*Header!$E$17","v":0},{"$f":"IF(Header!$C$12=\"Summer\",SUM($AL10:$AN10),IF(Header!$C$12=\"Autumn\",SUM($AJ10:$AN10),IF(Header!$C$12=\"Spring\",SUM($AK10:$AN10),0)))*$I10","v":0},0,null,0,null,0]
[null,null,null,null,null,null,null,null,null,null,null,null,null,0,0,0,0,0,0,0,0,0,0,0,0,0,0,null,0,{"$f":"IF(AC11=1,IF(AC$7=$K11,0,1),IF(AD$7=$J11,1,0))","v":0},0,0,0,0,0,0,0,0,0,0,null,{"$f":"$C11*$F11*SUM(Header!$C$13:$C$15)","v":0},{"$f":"IF($G11>15,15,$G11)*$C11*Header!$C$16","v":0},{"$f":"IF($F11>15,15,$F11)*$C11*Header!$C$17","v":0},{"$f":"IF(Header!$C$12=\"Summer\",SUM($AC11:$AG11),IF(Header!$C$12=\"Autumn\",SUM($AC11:$AF11),IF(Header!$C$12=\"Spring\",SUM($AC11:$AE11),0)))*$I11","v":0},0,null,{"$f":"$D11*$F11*SUM(Header!$D$13:$D$15)","v":0},{"$f":"IF($G11>15,15,$G11)*$D11*Header!$D$16","v":0},{"$f":"IF($F11>15,15,$F11)*$D11*Header!$D$17","v":0},{"$f":"IF(Header!$C$12=\"Summer\",SUM($AH11:$AK11),IF(Header!$C$12=\"Autumn\",SUM($AG11:$AI11),IF(Header!$C$12=\"Spring\",SUM($AF11:$AJ11),0)))*$I11","v":0},0,null,{"$f":"$E11*$F11*SUM(Header!$E$13:$E$15)","v":0},{"$f":"IF($G11>15,15,$G11)*$E11*Header!$E$16","v":0},{"$f":"IF($F11>15,15,$F11)*$E11*Header!$E$17","v":0},{"$f":"IF(Header!$C$12=\"Summer\",SUM($AL11:$AN11),IF(Header!$C$12=\"Autumn\",SUM($AJ11:$AN11),IF(Header!$C$12=\"Spring\",SUM($AK11:$AN11),0)))*$I11","v":0},0,null,0,null,0]
[null,null,null,null,null,null,null,null,null,null,null,null,null,0,0,0,0,0,0,0,0,0,0,0,0,0,0,null,0,{"$f":"IF(AC12=1,IF(AC$7=$K12,0,1),IF(AD$7=$J12,1,0))","v":0},0,0,0,0,0,0,0,0,0,0,null,{"$f":"$C12*$F12*SUM(Header!$C$13:$C$15)","v":0},{"$f":"IF($G12>15,15,$G12)*$C12*Header!$C$16","v":0},{"$f":"IF($F12>15,15,$F12)*$C12*Header!$C$17","v":0},{"$f":"IF(Header!$C$12=\"Summer\",SUM($AC12:$AG12),IF(Header!$C$12=\"Autumn\",SUM($AC12:$AF12),IF(Header!$C$12=\"Spring\",SUM($AC12:$AE12),0)))*$I12","v":0},0,null,{"$f":"$D12*$F12*SUM(Header!$D$13:$D$15)","v":0},{"$f":"IF($G12>15,15,$G12)*$D12*Header!$D$16","v":0},{"$f":"IF($F12>15,15,$F12)*$D12*Header!$D$17","v":0},{"$f":"IF(Header!$C$12=\"Summer\",SUM($AH12:$AK12),IF(Header!$C$12=\"Autumn\",SUM($AG12:$AI12),IF(Header!$C$12=\"Spring\",SUM($AF12:$AJ12),0)))*$I12","v":0},0,null,{"$f":"$E12*$F12*SUM(Header!$E$13:$E$15)","v":0},{"$f":"IF($G12>15,15,$G12)*$E12*Header!$E$16","v":0},{"$f":"IF($F12>15,15,$F12)*$E12*Header!$E$17","v":0},{"$f":"IF(Header!$C$12=\"Summer\",SUM($AL12:$AN12),IF(Header!$C$12=\"Autumn\",SUM($AJ12:$AN12),IF(Header!$C$12=\"Spring\",SUM($AK12:$AN12),0)))*$I12","v":0},0,null,0,null,0]
[null,null,null,null,null,null,null,null,null,null,null,null,null,0,0,0,0,0,0,0,0,0,0,0,0,0,0,null,0,{"$f":"IF(AC13=1,IF(AC$7=$K13,0,1),IF(AD$7=$J13,1,0))","v":0},0,0,0,0,0,0,0,0,0,0,null,{"$f":"$C13*$F13*SUM(Header!$C$13:$C$15)","v":0},{"$f":"IF($G13>15,15,$G13)*$C13*Header!$C$16","v":0},{"$f":"IF($F13>15,15,$F13)*$C13*Header!$C$17","v":0},{"$f":"IF(Header!$C$12=\"Summer\",SUM($AC13:$AG13),IF(Header!$C$12=\"Autumn\",SUM($AC13:$AF13),IF(Header!$C$12=\"Spring\",SUM($AC13:$AE13),0)))*$I13","v":0},0,null,{"$f":"$D13*$F13*SUM(Header!$D$13:$D$15)","v":0},{"$f":"IF($G13>15,15,$G13)*$D13*Header!$D$16","v":0},{"$f":"IF($F13>15,15,$F13)*$D13*Header!$D$17","v":0},{"$f":"IF(Header!$C$12=\"Summer\",SUM($AH13:$AK13),IF(Header!$C$12=\"Autumn\",SUM($AG13:$AI13),IF(Header!$C$12=\"Spring\",SUM($AF13:$AJ13),0)))*$I13","v":0},0,null,{"$f":"$E13*$F13*SUM(Header!$E$13:$E$15)","v":0},{"$f":"IF($G13>15,15,$G13)*$E13*Header!$E$16","v":0},{"$f":"IF($F13>15,15,$F13)*$E13*Header!$E$17","v":0},{"$f":"IF(Header!$C$12=\"Summer\",SUM($AL13:$AN13),IF(Header!$C$12=\"Autumn\",SUM($AJ13:$AN13),IF(Header!$C$12=\"Spring\",SUM($AK13:$AN13),0)))*$I13","v":0},0,null,0,null,0]
[null,null,null,null,null,null,null,null,null,null,null,null,null,0,0,0,0,0,0,0,0,0,0,0,0,0,0,null,0,{"$f":"IF(AC14=1,IF(AC$7=$K14,0,1),IF(AD$7=$J14,1,0))","v":0},0,0,0,0,0,0,0,0,0,0,null,{"$f":"$C14*$F14*SUM(Header!$C$13:$C$15)","v":0},{"$f":"IF($G14>15,15,$G14)*$C14*Header!$C$16","v":0},{"$f":"IF($F14>15,15,$F14)*$C14*Header!$C$17","v":0},{"$f":"IF(Header!$C$12=\"Summer\",SUM($AC14:$AG14),IF(Header!$C$12=\"Autumn\",SUM($AC14:$AF14),IF(Header!$C$12=\"Spring\",SUM($AC14:$AE14),0)))*$I14","v":0},0,null,{"$f":"$D14*$F14*SUM(Header!$D$13:$D$15)","v":0},{"$f":"IF($G14>15,15,$G14)*$D14*Header!$D$16","v":0},{"$f":"IF($F14>15,15,$F14)*$D14*Header!$D$17","v":0},{"$f":"IF(Header!$C$12=\"Summer\",SUM($AH14:$AK14),IF(Header!$C$12=\"Autumn\",SUM($AG14:$AI14),IF(Header!$C$12=\"Spring\",SUM($AF14:$AJ14),0)))*$I14","v":0},0,null,{"$f":"$E14*$F14*SUM(Header!$E$13:$E$15)","v":0},{"$f":"IF($G14>15,15,$G14)*$E14*Header!$E$16","v":0},{"$f":"IF($F14>15,15,$F14)*$E14*Header!$E$17","v":0},{"$f":"IF(Header!$C$12=\"Summer\",SUM($AL14:$AN14),IF(Header!$C$12=\"Autumn\",SUM($AJ14:$AN14),IF(Header!$C$12=\"Spring\",SUM($AK14:$AN14),0)))*$I14","v":0},0,null,0,null,0]
[null,null,null,null,null,null,null,null,null,null,null,null,null,0,0,0,0,0,0,0,0,0,0,0,0,0,0,null,0,{"$f":"IF(AC15=1,IF(AC$7=$K15,0,1),IF(AD$7=$J15,1,0))","v":0},0,0,0,0,0,0,0,0,0,0,null,{"$f":"$C15*$F15*SUM(Header!$C$13:$C$15)","v":0},{"$f":"IF($G15>15,15,$G15)*$C15*Header!$C$16","v":0},{"$f":"IF($F15>15,15,$F15)*$C15*Header!$C$17","v":0},{"$f":"IF(Header!$C$12=\"Summer\",SUM($AC15:$AG15),IF(Header!$C$12=\"Autumn\",SUM($AC15:$AF15),IF(Header!$C$12=\"Spring\",SUM($AC15:$AE15),0)))*$I15","v":0},0,null,{"$f":"$D15*$F15*SUM(Header!$D$13:$D$15)","v":0},{"$f":"IF($G15>15,15,$G15)*$D15*Header!$D$16","v":0},{"$f":"IF($F15>15,15,$F15)*$D15*Header!$D$17","v":0},{"$f":"IF(Header!$C$12=\"Summer\",SUM($AH15:$AK15),IF(Header!$C$12=\"Autumn\",SUM($AG15:$AI15),IF(Header!$C$12=\"Spring\",SUM($AF15:$AJ15),0)))*$I15","v":0},0,null,{"$f":"$E15*$F15*SUM(Header!$E$13:$E$15)","v":0},{"$f":"IF($G15>15,15,$G15)*$E15*Header!$E$16","v":0},{"$f":"IF($F15>15,15,$F15)*$E15*Header!$E$17","v":0},{"$f":"IF(Header!$C$12=\"Summer\",SUM($AL15:$AN15),IF(Header!$C$12=\"Autumn\",SUM($AJ15:$AN15),IF(Header!$C$12=\"Spring\",SUM($AK15:$AN15),0)))*$I15","v":0},0,null,0,null,0]
[null,null,null,null,null,null,null,null,null,null,null,null,null,0,0,0,0,0,0,0,0,0,0,0,0,0,0,null,0,{"$f":"IF(AC16=1,IF(AC$7=$K16,0,1),IF(AD$7=$J16,1,0))","v":0},0,0,0,0,0,0,0,0,0,0,null,{"$f":"$C16*$F16*SUM(Header!$C$13:$C$15)","v":0},{"$f":"IF($G16>15,15,$G16)*$C16*Header!$C$16","v":0},{"$f":"IF($F16>15,15,$F16)*$C16*Header!$C$17","v":0},{"$f":"IF(Header!$C$12=\"Summer\",SUM($AC16:$AG16),IF(Header!$C$12=\"Autumn\",SUM($AC16:$AF16),IF(Header!$C$12=\"Spring\",SUM($AC16:$AE16),0)))*$I16","v":0},0,null,{"$f":"$D16*$F16*SUM(Header!$D$13:$D$15)","v":0},{"$f":"IF($G16>15,15,$G16)*$D16*Header!$D$16","v":0},{"$f":"IF($F16>15,15,$F16)*$D16*Header!$D$17","v":0},{"$f":"IF(Header!$C$12=\"Summer\",SUM($AH16:$AK16),IF(Header!$C$12=\"Autumn\",SUM($AG16:$AI16),IF(Header!$C$12=\"Spring\",SUM($AF16:$AJ16),0)))*$I16","v":0},0,null,{"$f":"$E16*$F16*SUM(Header!$E$13:$E$15)","v":0},{"$f":"IF($G16>15,15,$G16)*$E16*Header!$E$16","v":0},{"$f":"IF($F16>15,15,$F16)*$E16*Header!$E$17","v":0},{"$f":"IF(Header!$C$12=\"Summer\",SUM($AL16:$AN16),IF(Header!$C$12=\"Autumn\",SUM($AJ16:$AN16),IF(Header!$C$12=\"Spring\",SUM($AK16:$AN16),0)))*$I16","v":0},0,null,0,null,0]
[null,null,null,null,null,null,null,null,null,null,null,null,null,0,0,0,0,0,0,0,0,0,0,0,0,0,0,null,0,{"$f":"IF(AC17=1,IF(AC$7=$K17,0,1),IF(AD$7=$J17,1,0))","v":0},0,0,0,0,0,0,0,0,0,0,null,{"$f":"$C17*$F17*SUM(Header!$C$13:$C$15)","v":0},{"$f":"IF($G17>15,15,$G17)*$C17*Header!$C$16","v":0},{"$f":"IF($F17>15,15,$F17)*$C17*Header!$C$17","v":0},{"$f":"IF(Header!$C$12=\"Summer\",SUM($AC17:$AG17),IF(Header!$C$12=\"Autumn\",SUM($AC17:$AF17),IF(Header!$C$12=\"Spring\",SUM($AC17:$AE17),0)))*$I17","v":0},0,null,{"$f":"$D17*$F17*SUM(Header!$D$13:$D$15)","v":0},{"$f":"IF($G17>15,15,$G17)*$D17*Header!$D$16","v":0},{"$f":"IF($F17>15,15,$F17)*$D17*Header!$D$17","v":0},{"$f":"IF(Header!$C$12=\"Summer\",SUM($AH17:$AK17),IF(Header!$C$12=\"Autumn\",SUM($AG17:$AI17),IF(Header!$C$12=\"Spring\",SUM($AF17:$AJ17),0)))*$I17","v":0},0,null,{"$f":"$E17*$F17*SUM(Header!$E$13:$E$15)","v":0},{"$f":"IF($G17>15,15,$G17)*$E17*Header!$E$16","v":0},{"$f":"IF($F17>15,15,$F17)*$E17*Header!$E$17","v":0},{"$f":"IF(Header!$C$12=\"Summer\",SUM($AL17:$AN17),IF(Header!$C$12=\"Autumn\",SUM($AJ17:$AN17),IF(Header!$C$12=\"Spring\",SUM($AK17:$AN17),0)))*$I17","v":0},0,null,0,null,0]
[null,null,null,null,null,null,null,null,null,null,null,null,null,0,0,0,0,0,0,0,0,0,0,0,0,0,0,null,0,{"$f":"IF(AC18=1,IF(AC$7=$K18,0,1),IF(AD$7=$J18,1,0))","v":0},0,0,0,0,0,0,0,0,0,0,null,{"$f":"$C18*$F18*SUM(Header!$C$13:$C$15)","v":0},{"$f":"IF($G18>15,15,$G18)*$C18*Header!$C$16","v":0},{"$f":"IF($F18>15,15,$F18)*$C18*Header!$C$17","v":0},{"$f":"IF(Header!$C$12=\"Summer\",SUM($AC18:$AG18),IF(Header!$C$12=\"Autumn\",SUM($AC18:$AF18),IF(Header!$C$12=\"Spring\",SUM($AC18:$AE18),0)))*$I18","v":0},0,null,{"$f":"$D18*$F18*SUM(Header!$D$13:$D$15)","v":0},{"$f":"IF($G18>15,15,$G18)*$D18*Header!$D$16","v":0},{"$f":"IF($F18>15,15,$F18)*$D18*Header!$D$17","v":0},{"$f":"IF(Header!$C$12=\"Summer\",SUM($AH18:$AK18),IF(Header!$C$12=\"Autumn\",SUM($AG18:$AI18),IF(Header!$C$12=\"Spring\",SUM($AF18:$AJ18),0)))*$I18","v":0},0,null,{"$f":"$E18*$F18*SUM(Header!$E$13:$E$15)","v":0},{"$f":"IF($G18>15,15,$G18)*$E18*Header!$E$16","v":0},{"$f":"IF($F18>15,15,$F18)*$E18*Header!$E$17","v":0},{"$f":"IF(Header!$C$12=\"Summer\",SUM($AL18:$AN18),IF(Header!$C$12=\"Autumn\",SUM($AJ18:$AN18),IF(Header!$C$12=\"Spring\",SUM($AK18:$AN18),0)))*$I18","v":0},0,null,0,null,0]
[null,null,null,null,null,null,null,null,null,null,null,null,null,0,0,0,0,0,0,0,0,0,0,0,0,0,0,null,0,{"$f":"IF(AC19=1,IF(AC$7=$K19,0,1),IF(AD$7=$J19,1,0))","v":0},0,0,0,0,0,0,0,0,0,0,null,{"$f":"$C19*$F19*SUM(Header!$C$13:$C$15)","v":0},{"$f":"IF($G19>15,15,$G19)*$C19*Header!$C$16","v":0},{"$f":"IF($F19>15,15,$F19)*$C19*Header!$C$17","v":0},{"$f":"IF(Header!$C$12=\"Summer\",SUM($AC19:$AG19),IF(Header!$C$12=\"Autumn\",SUM($AC19:$AF19),IF(Header!$C$12=\"Spring\",SUM($AC19:$AE19),0)))*$I19","v":0},0,null,{"$f":"$D19*$F19*SUM(Header!$D$13:$D$15)","v":0},{"$f":"IF($G19>15,15,$G19)*$D19*Header!$D$16","v":0},{"$f":"IF($F19>15,15,$F19)*$D19*Header!$D$17","v":0},{"$f":"IF(Header!$C$12=\"Summer\",SUM($AH19:$AK19),IF(Header!$C$12=\"Autumn\",SUM($AG19:$AI19),IF(Header!$C$12=\"Spring\",SUM($AF19:$AJ19),0)))*$I19","v":0},0,null,{"$f":"$E19*$F19*SUM(Header!$E$13:$E$15)","v":0},{"$f":"IF($G19>15,15,$G19)*$E19*Header!$E$16","v":0},{"$f":"IF($F19>15,15,$F19)*$E19*Header!$E$17","v":0},{"$f":"IF(Header!$C$12=\"Summer\",SUM($AL19:$AN19),IF(Header!$C$12=\"Autumn\",SUM($AJ19:$AN19),IF(Header!$C$12=\"Spring\",SUM($AK19:$AN19),0)))*$I19","v":0},0,null,0,null,0]
[null,null,null,null,null,null,null,null,null,null,null,null,null,0,0,0,0,0,0,0,0,0,0,0,0,0,0,null,0,{"$f":"IF(AC20=1,IF(AC$7=$K20,0,1),IF(AD$7=$J20,1,0))","v":0},0,0,0,0,0,0,0,0,0,0,null,{"$f":"$C20*$F20*SUM(Header!$C$13:$C$15)","v":0},{"$f":"IF($G20>15,15,$G20)*$C20*Header!$C$16","v":0},{"$f":"IF($F20>15,15,$F20)*$C20*Header!$C$17","v":0},{"$f":"IF(Header!$C$12=\"Summer\",SUM($AC20:$AG20),IF(Header!$C$12=\"Autumn\",SUM($AC20:$AF20),IF(Header!$C$12=\"Spring\",SUM($AC20:$AE20),0)))*$I20","v":0},0,null,{"$f":"$D20*$F20*SUM(Header!$D$13:$D$15)","v":0},{"$f":"IF($G20>15,15,$G20)*$D20*Header!$D$16","v":0},{"$f":"IF($F20>15,15,$F20)*$D20*Header!$D$17","v":0},{"$f":"IF(Header!$C$12=\"Summer\",SUM($AH20:$AK20),IF(Header!$C$12=\"Autumn\",SUM($AG20:$AI20),IF(Header!$C$12=\"Spring\",SUM($AF20:$AJ20),0)))*$I20","v":0},0,null,{"$f":"$E20*$F20*SUM(Header!$E$13:$E$15)","v":0},{"$f":"IF($G20>15,15,$G20)*$E20*Header!$E$16","v":0},{"$f":"IF($F20>15,15,$F20)*$E20*Header!$E$17","v":0},{"$f":"IF(Header!$C$12=\"Summer\",SUM($AL20:$AN20),IF(Header!$C$12=\"Autumn\",SUM($AJ20:$AN20),IF(Header!$C$12=\"Spring\",SUM($AK20:$AN20),0)))*$I20","v":0},0,null,0,null,0]
{"$rows_left_out":80}