{"text_format":"1","workbook":"xlsx","n_sheets":4,"sheets":["Data","Header","Early Years","Child Detail"],"not_rendered":{"charts":0,"images":1,"macros":1,"external_links":0,"defined_names":4,"comments":2,"pivot_tables":0},"unopened":[],"bounds":{"document_bytes":16777216,"sheet_cells":100000,"rows_first":2000,"rows_last":500,"rows_between":2000,"halvings":0,"cell_chars":16384,"cell_head_chars":4096},"cells_cut":0,"cells_raw":0,"read":"whole","date_system":"1900"}

{"sheet":"Data","index":0,"n_rows":4,"n_cols":19,"rows_kept":4,"cut":false,"hidden":true,"merged":[[0,1,0,3],[0,4,0,15],[0,16,0,18]]}
["Lists","Terms",null,null,"Months",null,null,null,null,null,null,null,null,null,null,null,"Weeks"]
[null,"Summer","Autumn","Spring","April","May","June","July","August","September","October","November","December","January","February","March",13,14,11]
[null,"Autumn","Spring","Summer","September","October","November","December","January","February","March","April","May","June","July","August",14,11,13]
[null,"Spring","Summer","Autumn","January","February","March","April","May","June","July","August","September","October","November","December",11,13,14]

{"sheet":"Header","index":1,"n_rows":17,"n_cols":5,"rows_kept":17,"cut":false,"hidden":false,"merged":[[3,2,3,7]]}
[]
[]
[null,"URN"]
[null,"Setting Name"]
[]
[]
[null,"First Term","Autumn"]
[]
[null,null,{"$f":"C7","v":"Autumn"},{"$f":"VLOOKUP($C$7,Data!$B$2:$C$4,2,0)","v":"Spring"},{"$f":"VLOOKUP($C$7,Data!$B$2:$D$4,3,0)","v":"Summer"}]
[null,"Stretched weeks"]
[]
[null,"Hourly Rate",{"$f":"C9","v":"Autumn"},{"$f":"D9","v":"Spring"},"Summer"]
[null,"3&4's Base rate"]
[null,"3&4's Quality (Qualified Leader) supplement"]
[null,"3&4's Disadvantage supplement"]
[null,"Free for Two"]
[null,"Early Years Pupil Premium (EYPP)"]

{"sheet":"Early Years","index":2,"n_rows":113,"n_cols":10,"rows_kept":113,"cut":false,"hidden":false,"merged":[[112,1,112,4],[3,0,3,5],[26,7,26,9],[53,7,53,9],[80,7,80,9],[110,1,110,4],[80,2,80,4],[53,2,53,4],[26,2,26,4],[8,1,8,5],[7,1,7,5]]}
[]
[]
[]
["Early Years Budget Estimation"]
[]
[null,null,null,null,"URN:",{"$f":"Header!C3","v":0}]
[]
[null,{"$f":"Header!C4","v":0}]
[null,"Summary Funding Table"]
[null,null,{"$f":"Header!C9","v":"Autumn"},{"$f":"Header!D9","v":"Spring"},{"$f":"Header!E9","v":"Summer"},"Total"]
[null,"3 & 4 Year old funding",{"$f":"C49+H49","v":0},{"$f":"D49+I49","v":0},0,{"$f":"SUM(C11:E11)","v":0}]
[null,"2 Year old funding",{"$f":"C76+H76","v":0},{"$f":"D76+I76","v":0},0,0]
[null,"Early Years Pupil Premium (EYPP)",{"$f":"C103+H103","v":0},{"$f":"D103+I103","v":0},0,0]
[null,"Special Educational Needs Inclusion Fund (SENIF)",{"$f":"C108","v":0},{"$f":"D108","v":0},0,0]
[null,"Disability Access Fund (DAF)",{"$f":"C109","v":0},0,0,0]
[null,"Total Funding",{"$f":"SUM(C11:C15)","v":0},{"$f":"SUM(D11:D15)","v":0},0,0]
[]
[]
[null,"3 & 4 Year old funding"]
[]
[null,"Hourly Rate",{"$f":"C10","v":"Autumn"},{"$f":"D10","v":"Spring"},{"$f":"E10","v":"Summer"}]
[null,"Base rate",{"$f":"Header!C13","v":0},{"$f":"Header!D13","v":0},{"$f":"Header!E13","v":0}]
[null,"Quality (Qualified Leader) supplement",{"$f":"Header!C14","v":0},{"$f":"Header!D14","v":0},{"$f":"Header!E14","v":0}]
[null,"Disadvantage supplement",{"$f":"Header!C15","v":0},{"$f":"Header!D15","v":0},{"$f":"Header!E15","v":0}]
[null,null,{"$f":"SUM(C22:C24)","v":0},{"$f":"SUM(D22:D24)","v":0},0]
[]
[null,"38 Weeks","Pupils",null,null,null,"Stretched","Pupils"]
[null,"Early Years Weekly Hours",{"$f":"C10","v":"Autumn"},{"$f":"D21","v":"Spring"},{"$f":"E21","v":"Summer"},null,"Early Years Weekly Hours",{"$f":"C28","v":"Autumn"},{"$f":"D28","v":"Spring"},{"$f":"E28","v":"Summer"}]
[]
[]
[]
[]
[]
[]
[]
[]
[]
[]
[]
[]
[]
[]
[]
[null,"Total pupils:",{"$f":"SUM(C29:C43)","v":0},{"$f":"SUM(D29:D43)","v":0},{"$f":"SUM(E29:E43)","v":0},null,"Total pupils:",{"$f":"SUM(H29:H43)","v":0},{"$f":"SUM(I29:I43)","v":0},{"$f":"SUM(J29:J43)","v":0}]
[null,"Total Weekly Hours:",{"$f":"SUMPRODUCT(C29:C43,$B$29:$B$43)","v":0},{"$f":"SUMPRODUCT(D29:D43,$B$29:$B$43)","v":0},{"$f":"SUMPRODUCT(E29:E43,$B$29:$B$43)","v":0},null,"Total Weekly Hours:",{"$f":"SUMPRODUCT(H29:H43,$G$29:$G$43)","v":0},{"$f":"SUMPRODUCT(I29:I43,$G$29:$G$43)","v":0},{"$f":"SUMPRODUCT(J29:J43,$G$29:$G$43)","v":0}]
[null,"Weeks:",{"$f":"VLOOKUP($C$28,Data!$B$2:$S$4,16,0)","v":14},{"$f":"VLOOKUP($C$28,Data!$B$2:$S$4,17,0)","v":11},{"$f":"VLOOKUP($C$28,Data!$B$2:$S$4,18,0)","v":13},null,"Weeks:",{"$f":"Header!C10","v":0},{"$f":"Header!D10","v":0},{"$f":"Header!E10","v":0}]
[null,"Total Hours for Term:",{"$f":"C45*$C$46","v":0},{"$f":"D45*$D$46","v":0},{"$f":"E45*$E$46","v":0},null,"Total Hours for Term:",{"$f":"H45*$H$46","v":0},{"$f":"I45*$I$46","v":0},{"$f":"J45*$J$46","v":0}]
[null,"Rate per funded hour:",{"$f":"C25","v":0},{"$f":"D25","v":0},{"$f":"E25","v":0},null,"Rate per funded hour:",{"$f":"C25","v":0},{"$f":"D25","v":0},{"$f":"E25","v":0}]
[null,"Estimated 3 & 4 Year Old Budget:",{"$f":"C48*C47","v":0},{"$f":"D48*D47","v":0},0,null,"Estimated 3 & 4 Year Old Budget:",{"$f":"H48*H47","v":0},{"$f":"I48*I47","v":0},0]
[]
[]
[null,"2 Year old funding"]
[]
[null,"38 Weeks","Pupils",null,null,null,"Stretched","Pupils"]
[null,"Early Years Weekly Hours",{"$f":"C28","v":"Autumn"},{"$f":"D28","v":"Spring"},{"$f":"E28","v":"Summer"},null,"Early Years Weekly Hours",{"$f":"H28","v":"Autumn"},{"$f":"I28","v":"Spring"},{"$f":"J28","v":"Summer"}]
[]
[]
[]
[]
[]
[]
[]
[]
[]
[]
[]
[]
[]
[]
[]
[null,"Total pupils:",{"$f":"SUM(C56:C70)","v":0},{"$f":"SUM(D56:D70)","v":0},{"$f":"SUM(E56:E70)","v":0},null,"Total pupils:",{"$f":"SUM(H56:H70)","v":0},{"$f":"SUM(I56:I70)","v":0},{"$f":"SUM(J56:J70)","v":0}]
[null,"Total Weekly Hours:",{"$f":"SUMPRODUCT(C56:C70,$B$56:$B$70)","v":0},{"$f":"SUMPRODUCT(D56:D70,$B$56:$B$70)","v":0},{"$f":"SUMPRODUCT(E56:E70,$B$56:$B$70)","v":0},null,"Total Weekly Hours:",{"$f":"SUMPRODUCT(H56:H70,$G$56:$G$70)","v":0},{"$f":"SUMPRODUCT(I56:I70,$G$56:$G$70)","v":0},{"$f":"SUMPRODUCT(J56:J70,$G$56:$G$70)","v":0}]
[null,"Weeks:",{"$f":"C46","v":14},{"$f":"D46","v":11},{"$f":"E46","v":13},null,"Weeks:",{"$f":"H46","v":0},{"$f":"I46","v":0},{"$f":"J46","v":0}]
[null,"Total Hours for Term:",{"$f":"C72*C73","v":0},{"$f":"D72*D73","v":0},{"$f":"E72*E73","v":0},null,"Total Hours for Term:",{"$f":"H72*H73","v":0},{"$f":"I72*I73","v":0},{"$f":"J72*J73","v":0}]
[null,"Rate per funded hour:",{"$f":"Header!C16","v":0},{"$f":"Header!D16","v":0},{"$f":"Header!E16","v":0},null,"Rate per funded hour:",{"$f":"C75","v":0},{"$f":"D75","v":0},{"$f":"E75","v":0}]
[null,"Estimated 2 Year old Funding:",{"$f":"C74*C75","v":0},{"$f":"D74*D75","v":0},{"$f":"E74*E75","v":0},null,"Estimated 2 Year old Funding:",{"$f":"H74*H75","v":0},{"$f":"I74*I75","v":0},{"$f":"J74*J75","v":0}]
[]
[]
[null,"Early Years Pupil Premium (EYPP)"]
[]
[null,"38 Weeks","Pupils",null,null,null,"Stretched","Pupils"]
[null,"Early Years Weekly Hours",{"$f":"C55","v":"Autumn"},{"$f":"D55","v":"Spring"},{"$f":"E55","v":"Summer"},null,"Early Years Weekly Hours",{"$f":"H55","v":"Autumn"},{"$f":"I55","v":"Spring"},{"$f":"J55","v":"Summer"}]
[]
[]
[]
[]
[]
[]
[]
[]
[]
[]
[]
[]
[]
[]
[]
[null,"Total pupils:",{"$f":"SUM(C83:C97)","v":0},{"$f":"SUM(D83:D97)","v":0},{"$f":"SUM(E83:E97)","v":0},null,"Total pupils:",{"$f":"SUM(H83:H97)","v":0},{"$f":"SUM(I83:I97)","v":0},{"$f":"SUM(J83:J97)","v":0}]
[null,"Total Weekly Hours:",{"$f":"SUMPRODUCT(C83:C97,$B$83:$B$97)","v":0},{"$f":"SUMPRODUCT(D83:D97,$B$83:$B$97)","v":0},{"$f":"SUMPRODUCT(E83:E97,$B$83:$B$97)","v":0},null,"Total Weekly Hours:",{"$f":"SUMPRODUCT(H83:H97,$G$83:$G$97)","v":0},{"$f":"SUMPRODUCT(I83:I97,$G$83:$G$97)","v":0},{"$f":"SUMPRODUCT(J83:J97,$G$83:$G$97)","v":0}]
[null,"Weeks:",{"$f":"C73","v":14},{"$f":"D73","v":11},{"$f":"E73","v":13},null,"Weeks:",{"$f":"H73","v":0},{"$f":"I73","v":0},{"$f":"J73","v":0}]
[null,"Total Hours for Term:",{"$f":"C99*C100","v":0},{"$f":"D99*D100","v":0},{"$f":"E99*E100","v":0},null,"Total Hours for Term:",{"$f":"H99*H100","v":0},{"$f":"I99*I100","v":0},{"$f":"J99*J100","v":0}]
[null,"Rate per funded hour:",{"$f":"Header!C17","v":0},{"$f":"Header!D17","v":0},{"$f":"Header!E17","v":0},null,"Rate per funded hour:",{"$f":"C102","v":0},{"$f":"D102","v":0},{"$f":"E102","v":0}]
[null,"Estimated Pupil Premium Funding:",{"$f":"C101*C102","v":0},{"$f":"D101*D102","v":0},0,null,"Estimated Pupil Premium Funding:",{"$f":"H101*H102","v":0},{"$f":"I101*I102","v":0},0]
[]
[]
[]
[null,null,{"$f":"C82","v":"Autumn"},{"$f":"D82","v":"Spring"},{"$f":"E82","v":"Summer"}]
[null,"Special Educational Needs Inclusion Fund (SENIF)"]
[null,"Disability Access Fund (DAF)"]
[]
[null,"Please only enter funding for pupils who qualify for the SENIF funding"]
[]
[null,"Please only enter funding for pupils who qualify for the DAF funding"]

{"sheet":"Child Detail","index":3,"n_rows":100,"n_cols":62,"rows_kept":100,"cut":false,"hidden":false,"merged":[[5,47,5,51],[5,53,5,57],[5,41,5,45]]}
[]
[null,null,null,null,null,"Early Years Budget Estimation"]
[null,null,null,null,null,{"$f":"Header!C3","v":0},{"$f":"Header!C4","v":0}]
[]
[null,null,null,null,null,null,null,null,null,null,null,null,null,null,null,null,null,null,null,null,null,null,null,null,null,null,null,null,null,null,null,null,null,null,null,null,null,null,null,null,null,"*FF2 & EYPP is only funded up to the maximum of 15 hours",null,null,null,null,null,"*FF2 & EYPP is only funded up to the maximum of 15 hours",null,null,null,null,null,"*FF2 & EYPP is only funded up to the maximum of 15 hours"]
[null,null,null,null,null,null,null,null,null,null,null,null,null,null,null,null,null,null,null,null,null,null,null,null,null,null,null,null,null,null,null,null,null,null,null,null,null,null,null,null,null,{"$f":"Header!C9&\" Term Funding\"","v":"Autumn Term Funding"},null,null,null,null,null,{"$f":"Header!D9&\" Term Funding\"","v":"Spring Term Funding"},null,null,null,null,null,{"$f":"Header!E9&\" Term Funding\"","v":"Summer Term Funding"}]
[null,"Child's Name",{"$f":"\"Weeks Funded for \"&Header!C9&\" Term\"","v":"Weeks Funded for Autumn Term"},{"$f":"\"Weeks Funded for \"&Header!D9&\" Term\"","v":"Weeks Funded for Spring Term"},{"$f":"\"Weeks Funded for \"&Header!E9&\" Term\"","v":"Weeks Funded for Summer Term"},"3 & 4 Year old funding weekly hours","2 Year old funding weekly hours","Early Years Pupil Premium (EYPP)","Monthly Special Educational Needs Inclusion Fund (SENIF)","SENIF Funding Start Month","SENIF Funding Stop Month","Disability Access Fund (DAF)",null,{"$f":"VLOOKUP(Header!$C$7,Data!$B$2:$P$4,4,0)","v":"September"},{"$f":"VLOOKUP(Header!$C$7,Data!$B$2:$P$4,5,0)","v":"October"},{"$f":"VLOOKUP(Header!$C$7,Data!$B$2:$P$4,6,0)","v":"November"},{"$f":"VLOOKUP(Header!$C$7,Data!$B$2:$P$4,7,0)","v":"December"},{"$f":"VLOOKUP(Header!$C$7,Data!$B$2:$P$4,8,0)","v":"January"},{"$f":"VLOOKUP(Header!$C$7,Data!$B$2:$P$4,9,0)","v":"February"},{"$f":"VLOOKUP(Header!$C$7,Data!$B$2:$P$4,10,0)","v":"March"},{"$f":"VLOOKUP(Header!$C$7,Data!$B$2:$P$4,11,0)","v":"April"},{"$f":"VLOOKUP(Header!$C$7,Data!$B$2:$P$4,12,0)","v":"May"},{"$f":"VLOOKUP(Header!$C$7,Data!$B$2:$P$4,13,0)","v":"June"},{"$f":"VLOOKUP(Header!$C$7,Data!$B$2:$P$4,14,0)","v":"July"},{"$f":"VLOOKUP(Header!$C$7,Data!$B$2:$P$4,15,0)","v":"August"},"DAF","Total Funding",null,{"$f":"N7","v":"September"},{"$f":"O7","v":"October"},"November","December","January","February","March","April","May","June","July","August",null,"3&4\nFunding","FF2\nFunding","EYPP\nFunding","SENIF Funding","Total\nFunding",null,"3&4\nFunding","FF2\nFunding","EYPP\nFunding","SENIF Funding","Total\nFunding",null,"3&4\nFunding","FF2\nFunding","EYPP\nFunding","SENIF Funding","Total\nFunding",null,"DAF",null,"Total Funding"]
[null,"A",14,11,13,15,null,"YES",100,"January","July","YES",null,{"$f":"IF(N$7=\"April\",SUM($AP8:$AR8)/5,IF(N$7=\"September\",SUM($AP8:$AR8)/4,SUM($AP8:$AR8)/3))+(AC8*$I8)","v":0},{"$f":"IF(O$7=\"May\",SUM($AP8:$AR8)/5,IF(O$7=\"October\",SUM($AP8:$AR8)/4,SUM($AP8:$AR8)/3))+(AD8*$I8)","v":0},{"$f":"IF(P$7=\"June\",SUM($AP8:$AR8)/5,IF(P$7=\"November\",SUM($AP8:$AR8)/4,SUM($AP8:$AR8)/3))+(AE8*$I8)","v":0},{"$f":"IF(Q$7=\"July\",SUM($AP8:$AR8)/5,IF(Q$7=\"December\",SUM($AP8:$AR8)/4,SUM($AV8:$AX8)/5))+(AF8*$I8)","v":0},{"$f":"IF(R$7=\"August\",SUM($AP8:$AR8)/5,IF(R$7=\"January\",SUM($AV8:$AX8)/3,SUM($AV8:$AX8)/5))+(AG8*$I8)","v":100},{"$f":"IF(S$7=\"September\",SUM($AV8:$AX8)/4,IF(S$7=\"February\",SUM($AV8:$AX8)/3,SUM($AV8:$AX8)/5))+(AH8*$I8)","v":100},{"$f":"IF(T$7=\"October\",SUM($AV8:$AX8)/4,IF(T$7=\"March\",SUM($AV8:$AX8)/3,SUM($AV8:$AX8)/5))+(AI8*$I8)","v":100},{"$f":"IF(U$7=\"November\",SUM($AV8:$AX8)/4,IF(U$7=\"April\",SUM($BB8:$BD8)/5,SUM($AV8:$AX8)/5))+(AJ8*$I8)","v":100},{"$f":"IF(V$7=\"December\",SUM($AV8:$AX8)/4,IF(V$7=\"May\",SUM($BB8:$BD8)/5,SUM($BB8:$BD8)/4))+(AK8*$I8)","v":100},{"$f":"IF(W$7=\"January\",SUM($BB8:$BD8)/3,IF(W$7=\"June\",SUM($BB8:$BD8)/5,SUM($BB8:$BD8)/4))+(AL8*$I8)","v":100},{"$f":"IF(X$7=\"February\",SUM($BB8:$BD8)/3,IF(X$7=\"July\",SUM($BB8:$BD8)/5,SUM($BB8:$BD8)/4))+(AM8*$I8)","v":100},{"$f":"IF(Y$7=\"March\",SUM($BB8:$BD8)/3,IF(Y$7=\"August\",SUM($BB8:$BD8)/5,SUM($BB8:$BD8)/4))+(AN8*$I8)","v":0},{"$f":"BH8","v":615},{"$f":"SUM(N8:Z8)","v":1315},null,{"$f":"IF(AC$7=$J8,1,0)","v":0},{"$f":"IF(AC8=1,IF(AC$7=$K8,0,1),IF(AD$7=$J8,1,0))","v":0},{"$f":"IF(AD8=1,IF(AD$7=$K8,0,1),IF(AE$7=$J8,1,0))","v":0},0,1,1,1,1,1,1,1,0,null,{"$f":"$C8*$F8*SUM(Header!$C$13:$C$15)","v":0},{"$f":"IF($G8>15,15,$G8)*$C8*Header!$C$16","v":0},{"$f":"IF($F8>15,15,$F8)*$C8*Header!$C$17","v":0},{"$f":"IF(Header!$C$12=\"Summer\",SUM($AC8:$AG8),IF(Header!$C$12=\"Autumn\",SUM($AC8:$AF8),IF(Header!$C$12=\"Spring\",SUM($AC8:$AE8),0)))*$I8","v":0},{"$f":"SUM(AP8:AS8)","v":0},null,{"$f":"$D8*$F8*SUM(Header!$D$13:$D$15)","v":0},{"$f":"IF($G8>15,15,$G8)*$D8*Header!$D$16","v":0},{"$f":"IF($F8>15,15,$F8)*$D8*Header!$D$17","v":0},{"$f":"IF(Header!$C$12=\"Summer\",SUM($AH8:$AK8),IF(Header!$C$12=\"Autumn\",SUM($AG8:$AI8),IF(Header!$C$12=\"Spring\",SUM($AF8:$AJ8),0)))*$I8","v":300},{"$f":"SUM(AV8:AY8)","v":300},null,{"$f":"$E8*$F8*SUM(Header!$E$13:$E$15)","v":0},{"$f":"IF($G8>15,15,$G8)*$E8*Header!$E$16","v":0},{"$f":"IF($F8>15,15,$F8)*$E8*Header!$E$17","v":0},{"$f":"IF(Header!$C$12=\"Summer\",SUM($AL8:$AN8),IF(Header!$C$12=\"Autumn\",SUM($AJ8:$AN8),IF(Header!$C$12=\"Spring\",SUM($AK8:$AN8),0)))*$I8","v":400},{"$f":"SUM(BB8:BE8)","v":400},null,{"$f":"IF(L8=\"YES\",615,0)","v":615},null,{"$f":"AT8+AZ8+BF8+BH8","v":1315}]
[null,"B",14,11,13,null,15,"YES",100,"April","September","YES",null,{"$f":"IF(N$7=\"April\",SUM($AP9:$AR9)/5,IF(N$7=\"September\",SUM($AP9:$AR9)/4,SUM($AP9:$AR9)/3))+(AC9*$I9)","v":0},{"$f":"IF(O$7=\"May\",SUM($AP9:$AR9)/5,IF(O$7=\"October\",SUM($AP9:$AR9)/4,SUM($AP9:$AR9)/3))+(AD9*$I9)","v":0},{"$f":"IF(P$7=\"June\",SUM($AP9:$AR9)/5,IF(P$7=\"November\",SUM($AP9:$AR9)/4,SUM($AP9:$AR9)/3))+(AE9*$I9)","v":0},{"$f":"IF(Q$7=\"July\",SUM($AP9:$AR9)/5,IF(Q$7=\"December\",SUM($AP9:$AR9)/4,SUM($AV9:$AX9)/5))+(AF9*$I9)","v":0},{"$f":"IF(R$7=\"August\",SUM($AP9:$AR9)/5,IF(R$7=\"January\",SUM($AV9:$AX9)/3,SUM($AV9:$AX9)/5))+(AG9*$I9)","v":0},{"$f":"IF(S$7=\"September\",SUM($AV9:$AX9)/4,IF(S$7=\"February\",SUM($AV9:$AX9)/3,SUM($AV9:$AX9)/5))+(AH9*$I9)","v":0},{"$f":"IF(T$7=\"October\",SUM($AV9:$AX9)/4,IF(T$7=\"March\",SUM($AV9:$AX9)/3,SUM($AV9:$AX9)/5))+(AI9*$I9)","v":0},{"$f":"IF(U$7=\"November\",SUM($AV9:$AX9)/4,IF(U$7=\"April\",SUM($BB9:$BD9)/5,SUM($AV9:$AX9)/5))+(AJ9*$I9)","v":100},{"$f":"IF(V$7=\"December\",SUM($AV9:$AX9)/4,IF(V$7=\"May\",SUM($BB9:$BD9)/5,SUM($BB9:$BD9)/4))+(AK9*$I9)","v":100},{"$f":"IF(W$7=\"January\",SUM($BB9:$BD9)/3,IF(W$7=\"June\",SUM($BB9:$BD9)/5,SUM($BB9:$BD9)/4))+(AL9*$I9)","v":100},{"$f":"IF(X$7=\"February\",SUM($BB9:$BD9)/3,IF(X$7=\"July\",SUM($BB9:$BD9)/5,SUM($BB9:$BD9)/4))+(AM9*$I9)","v":100},{"$f":"IF(Y$7=\"March\",SUM($BB9:$BD9)/3,IF(Y$7=\"August\",SUM($BB9:$BD9)/5,SUM($BB9:$BD9)/4))+(AN9*$I9)","v":100},{"$f":"BH9","v":615},{"$f":"SUM(N9:Z9)","v":1115},null,{"$f":"IF(AC$7=$J9,1,0)","v":0},{"$f":"IF(AC9=1,IF(AC$7=$K9,0,1),IF(AD$7=$J9,1,0))","v":0},0,0,0,0,0,1,1,1,1,1,null,{"$f":"$C9*$F9*SUM(Header!$C$13:$C$15)","v":0},{"$f":"IF($G9>15,15,$G9)*$C9*Header!$C$16","v":0},{"$f":"IF($F9>15,15,$F9)*$C9*Header!$C$17","v":0},{"$f":"IF(Header!$C$12=\"Summer\",SUM($AC9:$AG9),IF(Header!$C$12=\"Autumn\",SUM($AC9:$AF9),IF(Header!$C$12=\"Spring\",SUM($AC9:$AE9),0)))*$I9","v":0},{"$f":"SUM(AP9:AS9)","v":0},null,{"$f":"$D9*$F9*SUM(Header!$D$13:$D$15)","v":0},{"$f":"IF($G9>15,15,$G9)*$D9*Header!$D$16","v":0},{"$f":"IF($F9>15,15,$F9)*$D9*Header!$D$17","v":0},{"$f":"IF(Header!$C$12=\"Summer\",SUM($AH9:$AK9),IF(Header!$C$12=\"Autumn\",SUM($AG9:$AI9),IF(Header!$C$12=\"Spring\",SUM($AF9:$AJ9),0)))*$I9","v":0},{"$f":"SUM(AV9:AY9)","v":0},null,{"$f":"$E9*$F9*SUM(Header!$E$13:$E$15)","v":0},{"$f":"IF($G9>15,15,$G9)*$E9*Header!$E$16","v":0},{"$f":"IF($F9>15,15,$F9)*$E9*Header!$E$17","v":0},{"$f":"IF(Header!$C$12=\"Summer\",SUM($AL9:$AN9),IF(Header!$C$12=\"Autumn\",SUM($AJ9:$AN9),IF(Header!$C$12=\"Spring\",SUM($AK9:$AN9),0)))*$I9","v":500},{"$f":"SUM(BB9:BE9)","v":500},null,{"$f":"IF(L9=\"YES\",615,0)","v":615},null,{"$f":"AT9+AZ9+BF9+BH9","v":1115}]
[null,null,null,null,null,null,null,null,null,null,null,null,null,0,0,0,0,0,0,0,0,0,0,0,0,0,0,null,0,{"$f":"IF(AC10=1,IF(AC$7=$K10,0,1),IF(AD$7=$J10,1,0))","v":0},0,0,0,0,0,0,0,0,0,0,null,{"$f":"$C10*$F10*SUM(Header!$C$13:$C$15)","v":0},{"$f":"IF($G10>15,15,$G10)*$C10*Header!$C$16","v":0},{"$f":"IF($F10>15,15,$F10)*$C10*Header!$C$17","v":0},{"$f":"IF(Header!$C$12=\"Summer\",SUM($AC10:$AG10),IF(Header!$C$12=\"Autumn\",SUM($AC10:$AF10),IF(Header!$C$12=\"Spring\",SUM($AC10:$AE10),0)))*$I10","v":0},0,null,{"$f":"$D10*$F10*SUM(Header!$D$13:$D$15)","v":0},{"$f":"IF($G10>15,15,$G10)*$D10*Header!$D$16","v":0},{"$f":"IF($F10>15,15,$F10)*$D10*Header!$D$17","v":0},{"$f":"IF(Header!$C$12=\"Summer\",SUM($AH10:$AK10),IF(Header!$C$12=\"Autumn\",SUM($AG10:$AI10),IF(Header!$C$12=\"Spring\",SUM($AF10:$AJ10),0)))*$I10","v":0},0,null,{"$f":"$E10*$F10*SUM(Header!$E$13:$E$15)","v":0},{"$f":"IF($G10>15,15,$G10)*$E10*Header!$E$16","v":0},{"$f":"IF($F10>15,15,$F10)*$E10*Header!$E$17","v":0},{"$f":"IF(Header!$C$12=\"Summer\",SUM($AL10:$AN10),IF(Header!$C$12=\"Autumn\",SUM($AJ10:$AN10),IF(Header!$C$12=\"Spring\",SUM($AK10:$AN10),0)))*$I10","v":0},0,null,0,null,0]
[null,null,null,null,null,null,null,null,null,null,null,null,null,0,0,0,0,0,0,0,0,0,0,0,0,0,0,null,0,{"$f":"IF(AC11=1,IF(AC$7=$K11,0,1),IF(AD$7=$J11,1,0))","v":0},0,0,0,0,0,0,0,0,0,0,null,{"$f":"$C11*$F11*SUM(Header!$C$13:$C$15)","v":0},{"$f":"IF($G11>15,15,$G11)*$C11*Header!$C$16","v":0},{"$f":"IF($F11>15,15,$F11)*$C11*Header!$C$17","v":0},{"$f":"IF(Header!$C$12=\"Summer\",SUM($AC11:$AG11),IF(Header!$C$12=\"Autumn\",SUM($AC11:$AF11),IF(Header!$C$12=\"Spring\",SUM($AC11:$AE11),0)))*$I11","v":0},0,null,{"$f":"$D11*$F11*SUM(Header!$D$13:$D$15)","v":0},{"$f":"IF($G11>15,15,$G11)*$D11*Header!$D$16","v":0},{"$f":"IF($F11>15,15,$F11)*$D11*Header!$D$17","v":0},{"$f":"IF(Header!$C$12=\"Summer\",SUM($AH11:$AK11),IF(Header!$C$12=\"Autumn\",SUM($AG11:$AI11),IF(Header!$C$12=\"Spring\",SUM($AF11:$AJ11),0)))*$I11","v":0},0,null,{"$f":"$E11*$F11*SUM(Header!$E$13:$E$15)","v":0},{"$f":"IF($G11>15,15,$G11)*$E11*Header!$E$16","v":0},{"$f":"IF($F11>15,15,$F11)*$E11*Header!$E$17","v":0},{"$f":"IF(Header!$C$12=\"Summer\",SUM($AL11:$AN11),IF(Header!$C$12=\"Autumn\",SUM($AJ11:$AN11),IF(Header!$C$12=\"Spring\",SUM($AK11:$AN11),0)))*$I11","v":0},0,null,0,null,0]
[null,null,null,null,null,null,null,null,null,null,null,null,null,0,0,0,0,0,0,0,0,0,0,0,0,0,0,null,0,{"$f":"IF(AC12=1,IF(AC$7=$K12,0,1),IF(AD$7=$J12,1,0))","v":0},0,0,0,0,0,0,0,0,0,0,null,{"$f":"$C12*$F12*SUM(Header!$C$13:$C$15)","v":0},{"$f":"IF($G12>15,15,$G12)*$C12*Header!$C$16","v":0},{"$f":"IF($F12>15,15,$F12)*$C12*Header!$C$17","v":0},{"$f":"IF(Header!$C$12=\"Summer\",SUM($AC12:$AG12),IF(Header!$C$12=\"Autumn\",SUM($AC12:$AF12),IF(Header!$C$12=\"Spring\",SUM($AC12:$AE12),0)))*$I12","v":0},0,null,{"$f":"$D12*$F12*SUM(Header!$D$13:$D$15)","v":0},{"$f":"IF($G12>15,15,$G12)*$D12*Header!$D$16","v":0},{"$f":"IF($F12>15,15,$F12)*$D12*Header!$D$17","v":0},{"$f":"IF(Header!$C$12=\"Summer\",SUM($AH12:$AK12),IF(Header!$C$12=\"Autumn\",SUM($AG12:$AI12),IF(Header!$C$12=\"Spring\",SUM($AF12:$AJ12),0)))*$I12","v":0},0,null,{"$f":"$E12*$F12*SUM(Header!$E$13:$E$15)","v":0},{"$f":"IF($G12>15,15,$G12)*$E12*Header!$E$16","v":0},{"$f":"IF($F12>15,15,$F12)*$E12*Header!$E$17","v":0},{"$f":"IF(Header!$C$12=\"Summer\",SUM($AL12:$AN12),IF(Header!$C$12=\"Autumn\",SUM($AJ12:$AN12),IF(Header!$C$12=\"Spring\",SUM($AK12:$AN12),0)))*$I12","v":0},0,null,0,null,0]
[null,null,null,null,null,null,null,null,null,null,null,null,null,0,0,0,0,0,0,0,0,0,0,0,0,0,0,null,0,{"$f":"IF(AC13=1,IF(AC$7=$K13,0,1),IF(AD$7=$J13,1,0))","v":0},0,0,0,0,0,0,0,0,0,0,null,{"$f":"$C13*$F13*SUM(Header!$C$13:$C$15)","v":0},{"$f":"IF($G13>15,15,$G13)*$C13*Header!$C$16","v":0},{"$f":"IF($F13>15,15,$F13)*$C13*Header!$C$17","v":0},{"$f":"IF(Header!$C$12=\"Summer\",SUM($AC13:$AG13),IF(Header!$C$12=\"Autumn\",SUM($AC13:$AF13),IF(Header!$C$12=\"Spring\",SUM($AC13:$AE13),0)))*$I13","v":0},0,null,{"$f":"$D13*$F13*SUM(Header!$D$13:$D$15)","v":0},{"$f":"IF($G13>15,15,$G13)*$D13*Header!$D$16","v":0},{"$f":"IF($F13>15,15,$F13)*$D13*Header!$D$17","v":0},{"$f":"IF(Header!$C$12=\"Summer\",SUM($AH13:$AK13),IF(Header!$C$12=\"Autumn\",SUM($AG13:$AI13),IF(Header!$C$12=\"Spring\",SUM($AF13:$AJ13),0)))*$I13","v":0},0,null,{"$f":"$E13*$F13*SUM(Header!$E$13:$E$15)","v":0},{"$f":"IF($G13>15,15,$G13)*$E13*Header!$E$16","v":0},{"$f":"IF($F13>15,15,$F13)*$E13*Header!$E$17","v":0},{"$f":"IF(Header!$C$12=\"Summer\",SUM($AL13:$AN13),IF(Header!$C$12=\"Autumn\",SUM($AJ13:$AN13),IF(Header!$C$12=\"Spring\",SUM($AK13:$AN13),0)))*$I13","v":0},0,null,0,null,0]
[null,null,null,null,null,null,null,null,null,null,null,null,null,0,0,0,0,0,0,0,0,0,0,0,0,0,0,null,0,{"$f":"IF(AC14=1,IF(AC$7=$K14,0,1),IF(AD$7=$J14,1,0))","v":0},0,0,0,0,0,0,0,0,0,0,null,{"$f":"$C14*$F14*SUM(Header!$C$13:$C$15)","v":0},{"$f":"IF($G14>15,15,$G14)*$C14*Header!$C$16","v":0},{"$f":"IF($F14>15,15,$F14)*$C14*Header!$C$17","v":0},{"$f":"IF(Header!$C$12=\"Summer\",SUM($AC14:$AG14),IF(Header!$C$12=\"Autumn\",SUM($AC14:$AF14),IF(Header!$C$12=\"Spring\",SUM($AC14:$AE14),0)))*$I14","v":0},0,null,{"$f":"$D14*$F14*SUM(Header!$D$13:$D$15)","v":0},{"$f":"IF($G14>15,15,$G14)*$D14*Header!$D$16","v":0},{"$f":"IF($F14>15,15,$F14)*$D14*Header!$D$17","v":0},{"$f":"IF(Header!$C$12=\"Summer\",SUM($AH14:$AK14),IF(Header!$C$12=\"Autumn\",SUM($AG14:$AI14),IF(Header!$C$12=\"Spring\",SUM($AF14:$AJ14),0)))*$I14","v":0},0,null,{"$f":"$E14*$F14*SUM(Header!$E$13:$E$15)","v":0},{"$f":"IF($G14>15,15,$G14)*$E14*Header!$E$16","v":0},{"$f":"IF($F14>15,15,$F14)*$E14*Header!$E$17","v":0},{"$f":"IF(Header!$C$12=\"Summer\",SUM($AL14:$AN14),IF(Header!$C$12=\"Autumn\",SUM($AJ14:$AN14),IF(Header!$C$12=\"Spring\",SUM($AK14:$AN14),0)))*$I14","v":0},0,null,0,null,0]
[null,null,null,null,null,null,null,null,null,null,null,null,null,0,0,0,0,0,0,0,0,0,0,0,0,0,0,null,0,{"$f":"IF(AC15=1,IF(AC$7=$K15,0,1),IF(AD$7=$J15,1,0))","v":0},0,0,0,0,0,0,0,0,0,0,null,{"$f":"$C15*$F15*SUM(Header!$C$13:$C$15)","v":0},{"$f":"IF($G15>15,15,$G15)*$C15*Header!$C$16","v":0},{"$f":"IF($F15>15,15,$F15)*$C15*Header!$C$17","v":0},{"$f":"IF(Header!$C$12=\"Summer\",SUM($AC15:$AG15),IF(Header!$C$12=\"Autumn\",SUM($AC15:$AF15),IF(Header!$C$12=\"Spring\",SUM($AC15:$AE15),0)))*$I15","v":0},0,null,{"$f":"$D15*$F15*SUM(Header!$D$13:$D$15)","v":0},{"$f":"IF($G15>15,15,$G15)*$D15*Header!$D$16","v":0},{"$f":"IF($F15>15,15,$F15)*$D15*Header!$D$17","v":0},{"$f":"IF(Header!$C$12=\"Summer\",SUM($AH15:$AK15),IF(Header!$C$12=\"Autumn\",SUM($AG15:$AI15),IF(Header!$C$12=\"Spring\",SUM($AF15:$AJ15),0)))*$I15","v":0},0,null,{"$f":"$E15*$F15*SUM(Header!$E$13:$E$15)","v":0},{"$f":"IF($G15>15,15,$G15)*$E15*Header!$E$16","v":0},{"$f":"IF($F15>15,15,$F15)*$E15*Header!$E$17","v":0},{"$f":"IF(Header!$C$12=\"Summer\",SUM($AL15:$AN15),IF(Header!$C$12=\"Autumn\",SUM($AJ15:$AN15),IF(Header!$C$12=\"Spring\",SUM($AK15:$AN15),0)))*$I15","v":0},0,null,0,null,0]
[null,null,null,null,null,null,null,null,null,null,null,null,null,0,0,0,0,0,0,0,0,0,0,0,0,0,0,null,0,{"$f":"IF(AC16=1,IF(AC$7=$K16,0,1),IF(AD$7=$J16,1,0))","v":0},0,0,0,0,0,0,0,0,0,0,null,{"$f":"$C16*$F16*SUM(Header!$C$13:$C$15)","v":0},{"$f":"IF($G16>15,15,$G16)*$C16*Header!$C$16","v":0},{"$f":"IF($F16>15,15,$F16)*$C16*Header!$C$17","v":0},{"$f":"IF(Header!$C$12=\"Summer\",SUM($AC16:$AG16),IF(Header!$C$12=\"Autumn\",SUM($AC16:$AF16),IF(Header!$C$12=\"Spring\",SUM($AC16:$AE16),0)))*$I16","v":0},0,null,{"$f":"$D16*$F16*SUM(Header!$D$13:$D$15)","v":0},{"$f":"IF($G16>15,15,$G16)*$D16*Header!$D$16","v":0},{"$f":"IF($F16>15,15,$F16)*$D16*Header!$D$17","v":0},{"$f":"IF(Header!$C$12=\"Summer\",SUM($AH16:$AK16),IF(Header!$C$12=\"Autumn\",SUM($AG16:$AI16),IF(Header!$C$12=\"Spring\",SUM($AF16:$AJ16),0)))*$I16","v":0},0,null,{"$f":"$E16*$F16*SUM(Header!$E$13:$E$15)","v":0},{"$f":"IF($G16>15,15,$G16)*$E16*Header!$E$16","v":0},{"$f":"IF($F16>15,15,$F16)*$E16*Header!$E$17","v":0},{"$f":"IF(Header!$C$12=\"Summer\",SUM($AL16:$AN16),IF(Header!$C$12=\"Autumn\",SUM($AJ16:$AN16),IF(Header!$C$12=\"Spring\",SUM($AK16:$AN16),0)))*$I16","v":0},0,null,0,null,0]
[null,null,null,null,null,null,null,null,null,null,null,null,null,0,0,0,0,0,0,0,0,0,0,0,0,0,0,null,0,{"$f":"IF(AC17=1,IF(AC$7=$K17,0,1),IF(AD$7=$J17,1,0))","v":0},0,0,0,0,0,0,0,0,0,0,null,{"$f":"$C17*$F17*SUM(Header!$C$13:$C$15)","v":0},{"$f":"IF($G17>15,15,$G17)*$C17*Header!$C$16","v":0},{"$f":"IF($F17>15,15,$F17)*$C17*Header!$C$17","v":0},{"$f":"IF(Header!$C$12=\"Summer\",SUM($AC17:$AG17),IF(Header!$C$12=\"Autumn\",SUM($AC17:$AF17),IF(Header!$C$12=\"Spring\",SUM($AC17:$AE17),0)))*$I17","v":0},0,null,{"$f":"$D17*$F17*SUM(Header!$D$13:$D$15)","v":0},{"$f":"IF($G17>15,15,$G17)*$D17*Header!$D$16","v":0},{"$f":"IF($F17>15,15,$F17)*$D17*Header!$D$17","v":0},{"$f":"IF(Header!$C$12=\"Summer\",SUM($AH17:$AK17),IF(Header!$C$12=\"Autumn\",SUM($AG17:$AI17),IF(Header!$C$12=\"Spring\",SUM($AF17:$AJ17),0)))*$I17","v":0},0,null,{"$f":"$E17*$F17*SUM(Header!$E$13:$E$15)","v":0},{"$f":"IF($G17>15,15,$G17)*$E17*Header!$E$16","v":0},{"$f":"IF($F17>15,15,$F17)*$E17*Header!$E$17","v":0},{"$f":"IF(Header!$C$12=\"Summer\",SUM($AL17:$AN17),IF(Header!$C$12=\"Autumn\",SUM($AJ17:$AN17),IF(Header!$C$12=\"Spring\",SUM($AK17:$AN17),0)))*$I17","v":0},0,null,0,null,0]
[null,null,null,null,null,null,null,null,null,null,null,null,null,0,0,0,0,0,0,0,0,0,0,0,0,0,0,null,0,{"$f":"IF(AC18=1,IF(AC$7=$K18,0,1),IF(AD$7=$J18,1,0))","v":0},0,0,0,0,0,0,0,0,0,0,null,{"$f":"$C18*$F18*SUM(Header!$C$13:$C$15)","v":0},{"$f":"IF($G18>15,15,$G18)*$C18*Header!$C$16","v":0},{"$f":"IF($F18>15,15,$F18)*$C18*Header!$C$17","v":0},{"$f":"IF(Header!$C$12=\"Summer\",SUM($AC18:$AG18),IF(Header!$C$12=\"Autumn\",SUM($AC18:$AF18),IF(Header!$C$12=\"Spring\",SUM($AC18:$AE18),0)))*$I18","v":0},0,null,{"$f":"$D18*$F18*SUM(Header!$D$13:$D$15)","v":0},{"$f":"IF($G18>15,15,$G18)*$D18*Header!$D$16","v":0},{"$f":"IF($F18>15,15,$F18)*$D18*Header!$D$17","v":0},{"$f":"IF(Header!$C$12=\"Summer\",SUM($AH18:$AK18),IF(Header!$C$12=\"Autumn\",SUM($AG18:$AI18),IF(Header!$C$12=\"Spring\",SUM($AF18:$AJ18),0)))*$I18","v":0},0,null,{"$f":"$E18*$F18*SUM(Header!$E$13:$E$15)","v":0},{"$f":"IF($G18>15,15,$G18)*$E18*Header!$E$16","v":0},{"$f":"IF($F18>15,15,$F18)*$E18*Header!$E$17","v":0},{"$f":"IF(Header!$C$12=\"Summer\",SUM($AL18:$AN18),IF(Header!$C$12=\"Autumn\",SUM($AJ18:$AN18),IF(Header!$C$12=\"Spring\",SUM($AK18:$AN18),0)))*$I18","v":0},0,null,0,null,0]
[null,null,null,null,null,null,null,null,null,null,null,null,null,0,0,0,0,0,0,0,0,0,0,0,0,0,0,null,0,{"$f":"IF(AC19=1,IF(AC$7=$K19,0,1),IF(AD$7=$J19,1,0))","v":0},0,0,0,0,0,0,0,0,0,0,null,{"$f":"$C19*$F19*SUM(Header!$C$13:$C$15)","v":0},{"$f":"IF($G19>15,15,$G19)*$C19*Header!$C$16","v":0},{"$f":"IF($F19>15,15,$F19)*$C19*Header!$C$17","v":0},{"$f":"IF(Header!$C$12=\"Summer\",SUM($AC19:$AG19),IF(Header!$C$12=\"Autumn\",SUM($AC19:$AF19),IF(Header!$C$12=\"Spring\",SUM($AC19:$AE19),0)))*$I19","v":0},0,null,{"$f":"$D19*$F19*SUM(Header!$D$13:$D$15)","v":0},{"$f":"IF($G19>15,15,$G19)*$D19*Header!$D$16","v":0},{"$f":"IF($F19>15,15,$F19)*$D19*Header!$D$17","v":0},{"$f":"IF(Header!$C$12=\"Summer\",SUM($AH19:$AK19),IF(Header!$C$12=\"Autumn\",SUM($AG19:$AI19),IF(Header!$C$12=\"Spring\",SUM($AF19:$AJ19),0)))*$I19","v":0},0,null,{"$f":"$E19*$F19*SUM(Header!$E$13:$E$15)","v":0},{"$f":"IF($G19>15,15,$G19)*$E19*Header!$E$16","v":0},{"$f":"IF($F19>15,15,$F19)*$E19*Header!$E$17","v":0},{"$f":"IF(Header!$C$12=\"Summer\",SUM($AL19:$AN19),IF(Header!$C$12=\"Autumn\",SUM($AJ19:$AN19),IF(Header!$C$12=\"Spring\",SUM($AK19:$AN19),0)))*$I19","v":0},0,null,0,null,0]
[null,null,null,null,null,null,null,null,null,null,null,null,null,0,0,0,0,0,0,0,0,0,0,0,0,0,0,null,0,{"$f":"IF(AC20=1,IF(AC$7=$K20,0,1),IF(AD$7=$J20,1,0))","v":0},0,0,0,0,0,0,0,0,0,0,null,{"$f":"$C20*$F20*SUM(Header!$C$13:$C$15)","v":0},{"$f":"IF($G20>15,15,$G20)*$C20*Header!$C$16","v":0},{"$f":"IF($F20>15,15,$F20)*$C20*Header!$C$17","v":0},{"$f":"IF(Header!$C$12=\"Summer\",SUM($AC20:$AG20),IF(Header!$C$12=\"Autumn\",SUM($AC20:$AF20),IF(Header!$C$12=\"Spring\",SUM($AC20:$AE20),0)))*$I20","v":0},0,null,{"$f":"$D20*$F20*SUM(Header!$D$13:$D$15)","v":0},{"$f":"IF($G20>15,15,$G20)*$D20*Header!$D$16","v":0},{"$f":"IF($F20>15,15,$F20)*$D20*Header!$D$17","v":0},{"$f":"IF(Header!$C$12=\"Summer\",SUM($AH20:$AK20),IF(Header!$C$12=\"Autumn\",SUM($AG20:$AI20),IF(Header!$C$12=\"Spring\",SUM($AF20:$AJ20),0)))*$I20","v":0},0,null,{"$f":"$E20*$F20*SUM(Header!$E$13:$E$15)","v":0},{"$f":"IF($G20>15,15,$G20)*$E20*Header!$E$16","v":0},{"$f":"IF($F20>15,15,$F20)*$E20*Header!$E$17","v":0},{"$f":"IF(Header!$C$12=\"Summer\",SUM($AL20:$AN20),IF(Header!$C$12=\"Autumn\",SUM($AJ20:$AN20),IF(Header!$C$12=\"Spring\",SUM($AK20:$AN20),0)))*$I20","v":0},0,null,0,null,0]
[null,null,null,null,null,null,null,null,null,null,null,null,null,0,0,0,0,0,0,0,0,0,0,0,0,0,0,null,0,{"$f":"IF(AC21=1,IF(AC$7=$K21,0,1),IF(AD$7=$J21,1,0))","v":0},0,0,0,0,0,0,0,0,0,0,null,{"$f":"$C21*$F21*SUM(Header!$C$13:$C$15)","v":0},{"$f":"IF($G21>15,15,$G21)*$C21*Header!$C$16","v":0},{"$f":"IF($F21>15,15,$F21)*$C21*Header!$C$17","v":0},{"$f":"IF(Header!$C$12=\"Summer\",SUM($AC21:$AG21),IF(Header!$C$12=\"Autumn\",SUM($AC21:$AF21),IF(Header!$C$12=\"Spring\",SUM($AC21:$AE21),0)))*$I21","v":0},0,null,{"$f":"$D21*$F21*SUM(Header!$D$13:$D$15)","v":0},{"$f":"IF($G21>15,15,$G21)*$D21*Header!$D$16","v":0},{"$f":"IF($F21>15,15,$F21)*$D21*Header!$D$17","v":0},{"$f":"IF(Header!$C$12=\"Summer\",SUM($AH21:$AK21),IF(Header!$C$12=\"Autumn\",SUM($AG21:$AI21),IF(Header!$C$12=\"Spring\",SUM($AF21:$AJ21),0)))*$I21","v":0},0,null,{"$f":"$E21*$F21*SUM(Header!$E$13:$E$15)","v":0},{"$f":"IF($G21>15,15,$G21)*$E21*Header!$E$16","v":0},{"$f":"IF($F21>15,15,$F21)*$E21*Header!$E$17","v":0},{"$f":"IF(Header!$C$12=\"Summer\",SUM($AL21:$AN21),IF(Header!$C$12=\"Autumn\",SUM($AJ21:$AN21),IF(Header!$C$12=\"Spring\",SUM($AK21:$AN21),0)))*$I21","v":0},0,null,0,null,0]
[null,null,null,null,null,null,null,null,null,null,null,null,null,0,0,0,0,0,0,0,0,0,0,0,0,0,0,null,0,{"$f":"IF(AC22=1,IF(AC$7=$K22,0,1),IF(AD$7=$J22,1,0))","v":0},0,0,0,0,0,0,0,0,0,0,null,{"$f":"$C22*$F22*SUM(Header!$C$13:$C$15)","v":0},{"$f":"IF($G22>15,15,$G22)*$C22*Header!$C$16","v":0},{"$f":"IF($F22>15,15,$F22)*$C22*Header!$C$17","v":0},{"$f":"IF(Header!$C$12=\"Summer\",SUM($AC22:$AG22),IF(Header!$C$12=\"Autumn\",SUM($AC22:$AF22),IF(Header!$C$12=\"Spring\",SUM($AC22:$AE22),0)))*$I22","v":0},0,null,{"$f":"$D22*$F22*SUM(Header!$D$13:$D$15)","v":0},{"$f":"IF($G22>15,15,$G22)*$D22*Header!$D$16","v":0},{"$f":"IF($F22>15,15,$F22)*$D22*Header!$D$17","v":0},{"$f":"IF(Header!$C$12=\"Summer\",SUM($AH22:$AK22),IF(Header!$C$12=\"Autumn\",SUM($AG22:$AI22),IF(Header!$C$12=\"Spring\",SUM($AF22:$AJ22),0)))*$I22","v":0},0,null,{"$f":"$E22*$F22*SUM(Header!$E$13:$E$15)","v":0},{"$f":"IF($G22>15,15,$G22)*$E22*Header!$E$16","v":0},{"$f":"IF($F22>15,15,$F22)*$E22*Header!$E$17","v":0},{"$f":"IF(Header!$C$12=\"Summer\",SUM($AL22:$AN22),IF(Header!$C$12=\"Autumn\",SUM($AJ22:$AN22),IF(Header!$C$12=\"Spring\",SUM($AK22:$AN22),0)))*$I22","v":0},0,null,0,null,0]
[null,null,null,null,null,null,null,null,null,null,null,null,null,0,0,0,0,0,0,0,0,0,0,0,0,0,0,null,0,{"$f":"IF(AC23=1,IF(AC$7=$K23,0,1),IF(AD$7=$J23,1,0))","v":0},0,0,0,0,0,0,0,0,0,0,null,{"$f":"$C23*$F23*SUM(Header!$C$13:$C$15)","v":0},{"$f":"IF($G23>15,15,$G23)*$C23*Header!$C$16","v":0},{"$f":"IF($F23>15,15,$F23)*$C23*Header!$C$17","v":0},{"$f":"IF(Header!$C$12=\"Summer\",SUM($AC23:$AG23),IF(Header!$C$12=\"Autumn\",SUM($AC23:$AF23),IF(Header!$C$12=\"Spring\",SUM($AC23:$AE23),0)))*$I23","v":0},0,null,{"$f":"$D23*$F23*SUM(Header!$D$13:$D$15)","v":0},{"$f":"IF($G23>15,15,$G23)*$D23*Header!$D$16","v":0},{"$f":"IF($F23>15,15,$F23)*$D23*Header!$D$17","v":0},{"$f":"IF(Header!$C$12=\"Summer\",SUM($AH23:$AK23),IF(Header!$C$12=\"Autumn\",SUM($AG23:$AI23),IF(Header!$C$12=\"Spring\",SUM($AF23:$AJ23),0)))*$I23","v":0},0,null,{"$f":"$E23*$F23*SUM(Header!$E$13:$E$15)","v":0},{"$f":"IF($G23>15,15,$G23)*$E23*Header!$E$16","v":0},{"$f":"IF($F23>15,15,$F23)*$E23*Header!$E$17","v":0},{"$f":"IF(Header!$C$12=\"Summer\",SUM($AL23:$AN23),IF(Header!$C$12=\"Autumn\",SUM($AJ23:$AN23),IF(Header!$C$12=\"Spring\",SUM($AK23:$AN23),0)))*$I23","v":0},0,null,0,null,0]
[null,null,null,null,null,null,null,null,null,null,null,null,null,0,0,0,0,0,0,0,0,0,0,0,0,0,0,null,0,{"$f":"IF(AC24=1,IF(AC$7=$K24,0,1),IF(AD$7=$J24,1,0))","v":0},0,0,0,0,0,0,0,0,0,0,null,{"$f":"$C24*$F24*SUM(Header!$C$13:$C$15)","v":0},{"$f":"IF($G24>15,15,$G24)*$C24*Header!$C$16","v":0},{"$f":"IF($F24>15,15,$F24)*$C24*Header!$C$17","v":0},{"$f":"IF(Header!$C$12=\"Summer\",SUM($AC24:$AG24),IF(Header!$C$12=\"Autumn\",SUM($AC24:$AF24),IF(Header!$C$12=\"Spring\",SUM($AC24:$AE24),0)))*$I24","v":0},0,null,{"$f":"$D24*$F24*SUM(Header!$D$13:$D$15)","v":0},{"$f":"IF($G24>15,15,$G24)*$D24*Header!$D$16","v":0},{"$f":"IF($F24>15,15,$F24)*$D24*Header!$D$17","v":0},{"$f":"IF(Header!$C$12=\"Summer\",SUM($AH24:$AK24),IF(Header!$C$12=\"Autumn\",SUM($AG24:$AI24),IF(Header!$C$12=\"Spring\",SUM($AF24:$AJ24),0)))*$I24","v":0},0,null,{"$f":"$E24*$F24*SUM(Header!$E$13:$E$15)","v":0},{"$f":"IF($G24>15,15,$G24)*$E24*Header!$E$16","v":0},{"$f":"IF($F24>15,15,$F24)*$E24*Header!$E$17","v":0},{"$f":"IF(Header!$C$12=\"Summer\",SUM($AL24:$AN24),IF(Header!$C$12=\"Autumn\",SUM($AJ24:$AN24),IF(Header!$C$12=\"Spring\",SUM($AK24:$AN24),0)))*$I24","v":0},0,null,0,null,0]
[null,null,null,null,null,null,null,null,null,null,null,null,null,0,0,0,0,0,0,0,0,0,0,0,0,0,0,null,0,{"$f":"IF(AC25=1,IF(AC$7=$K25,0,1),IF(AD$7=$J25,1,0))","v":0},0,0,0,0,0,0,0,0,0,0,null,{"$f":"$C25*$F25*SUM(Header!$C$13:$C$15)","v":0},{"$f":"IF($G25>15,15,$G25)*$C25*Header!$C$16","v":0},{"$f":"IF($F25>15,15,$F25)*$C25*Header!$C$17","v":0},{"$f":"IF(Header!$C$12=\"Summer\",SUM($AC25:$AG25),IF(Header!$C$12=\"Autumn\",SUM($AC25:$AF25),IF(Header!$C$12=\"Spring\",SUM($AC25:$AE25),0)))*$I25","v":0},0,null,{"$f":"$D25*$F25*SUM(Header!$D$13:$D$15)","v":0},{"$f":"IF($G25>15,15,$G25)*$D25*Header!$D$16","v":0},{"$f":"IF($F25>15,15,$F25)*$D25*Header!$D$17","v":0},{"$f":"IF(Header!$C$12=\"Summer\",SUM($AH25:$AK25),IF(Header!$C$12=\"Autumn\",SUM($AG25:$AI25),IF(Header!$C$12=\"Spring\",SUM($AF25:$AJ25),0)))*$I25","v":0},0,null,{"$f":"$E25*$F25*SUM(Header!$E$13:$E$15)","v":0},{"$f":"IF($G25>15,15,$G25)*$E25*Header!$E$16","v":0},{"$f":"IF($F25>15,15,$F25)*$E25*Header!$E$17","v":0},{"$f":"IF(Header!$C$12=\"Summer\",SUM($AL25:$AN25),IF(Header!$C$12=\"Autumn\",SUM($AJ25:$AN25),IF(Header!$C$12=\"Spring\",SUM($AK25:$AN25),0)))*$I25","v":0},0,null,0,null,0]
[null,null,null,null,null,null,null,null,null,null,null,null,null,0,0,0,0,0,0,0,0,0,0,0,0,0,0,null,0,{"$f":"IF(AC26=1,IF(AC$7=$K26,0,1),IF(AD$7=$J26,1,0))","v":0},0,0,0,0,0,0,0,0,0,0,null,{"$f":"$C26*$F26*SUM(Header!$C$13:$C$15)","v":0},{"$f":"IF($G26>15,15,$G26)*$C26*Header!$C$16","v":0},{"$f":"IF($F26>15,15,$F26)*$C26*Header!$C$17","v":0},{"$f":"IF(Header!$C$12=\"Summer\",SUM($AC26:$AG26),IF(Header!$C$12=\"Autumn\",SUM($AC26:$AF26),IF(Header!$C$12=\"Spring\",SUM($AC26:$AE26),0)))*$I26","v":0},0,null,{"$f":"$D26*$F26*SUM(Header!$D$13:$D$15)","v":0},{"$f":"IF($G26>15,15,$G26)*$D26*Header!$D$16","v":0},{"$f":"IF($F26>15,15,$F26)*$D26*Header!$D$17","v":0},{"$f":"IF(Header!$C$12=\"Summer\",SUM($AH26:$AK26),IF(Header!$C$12=\"Autumn\",SUM($AG26:$AI26),IF(Header!$C$12=\"Spring\",SUM($AF26:$AJ26),0)))*$I26","v":0},0,null,{"$f":"$E26*$F26*SUM(Header!$E$13:$E$15)","v":0},{"$f":"IF($G26>15,15,$G26)*$E26*Header!$E$16","v":0},{"$f":"IF($F26>15,15,$F26)*$E26*Header!$E$17","v":0},{"$f":"IF(Header!$C$12=\"Summer\",SUM($AL26:$AN26),IF(Header!$C$12=\"Autumn\",SUM($AJ26:$AN26),IF(Header!$C$12=\"Spring\",SUM($AK26:$AN26),0)))*$I26","v":0},0,null,0,null,0]
[null,null,null,null,null,null,null,null,null,null,null,null,null,0,0,0,0,0,0,0,0,0,0,0,0,0,0,null,0,{"$f":"IF(AC27=1,IF(AC$7=$K27,0,1),IF(AD$7=$J27,1,0))","v":0},0,0,0,0,0,0,0,0,0,0,null,{"$f":"$C27*$F27*SUM(Header!$C$13:$C$15)","v":0},{"$f":"IF($G27>15,15,$G27)*$C27*Header!$C$16","v":0},{"$f":"IF($F27>15,15,$F27)*$C27*Header!$C$17","v":0},{"$f":"IF(Header!$C$12=\"Summer\",SUM($AC27:$AG27),IF(Header!$C$12=\"Autumn\",SUM($AC27:$AF27),IF(Header!$C$12=\"Spring\",SUM($AC27:$AE27),0)))*$I27","v":0},0,null,{"$f":"$D27*$F27*SUM(Header!$D$13:$D$15)","v":0},{"$f":"IF($G27>15,15,$G27)*$D27*Header!$D$16","v":0},{"$f":"IF($F27>15,15,$F27)*$D27*Header!$D$17","v":0},{"$f":"IF(Header!$C$12=\"Summer\",SUM($AH27:$AK27),IF(Header!$C$12=\"Autumn\",SUM($AG27:$AI27),IF(Header!$C$12=\"Spring\",SUM($AF27:$AJ27),0)))*$I27","v":0},0,null,{"$f":"$E27*$F27*SUM(Header!$E$13:$E$15)","v":0},{"$f":"IF($G27>15,15,$G27)*$E27*Header!$E$16","v":0},{"$f":"IF($F27>15,15,$F27)*$E27*Header!$E$17","v":0},{"$f":"IF(Header!$C$12=\"Summer\",SUM($AL27:$AN27),IF(Header!$C$12=\"Autumn\",SUM($AJ27:$AN27),IF(Header!$C$12=\"Spring\",SUM($AK27:$AN27),0)))*$I27","v":0},0,null,0,null,0]
[null,null,null,null,null,null,null,null,null,null,null,null,null,0,0,0,0,0,0,0,0,0,0,0,0,0,0,null,0,{"$f":"IF(AC28=1,IF(AC$7=$K28,0,1),IF(AD$7=$J28,1,0))","v":0},0,0,0,0,0,0,0,0,0,0,null,{"$f":"$C28*$F28*SUM(Header!$C$13:$C$15)","v":0},{"$f":"IF($G28>15,15,$G28)*$C28*Header!$C$16","v":0},{"$f":"IF($F28>15,15,$F28)*$C28*Header!$C$17","v":0},{"$f":"IF(Header!$C$12=\"Summer\",SUM($AC28:$AG28),IF(Header!$C$12=\"Autumn\",SUM($AC28:$AF28),IF(Header!$C$12=\"Spring\",SUM($AC28:$AE28),0)))*$I28","v":0},0,null,{"$f":"$D28*$F28*SUM(Header!$D$13:$D$15)","v":0},{"$f":"IF($G28>15,15,$G28)*$D28*Header!$D$16","v":0},{"$f":"IF($F28>15,15,$F28)*$D28*Header!$D$17","v":0},{"$f":"IF(Header!$C$12=\"Summer\",SUM($AH28:$AK28),IF(Header!$C$12=\"Autumn\",SUM($AG28:$AI28),IF(Header!$C$12=\"Spring\",SUM($AF28:$AJ28),0)))*$I28","v":0},0,null,{"$f":"$E28*$F28*SUM(Header!$E$13:$E$15)","v":0},{"$f":"IF($G28>15,15,$G28)*$E28*Header!$E$16","v":0},{"$f":"IF($F28>15,15,$F28)*$E28*Header!$E$17","v":0},{"$f":"IF(Header!$C$12=\"Summer\",SUM($AL28:$AN28),IF(Header!$C$12=\"Autumn\",SUM($AJ28:$AN28),IF(Header!$C$12=\"Spring\",SUM($AK28:$AN28),0)))*$I28","v":0},0,null,0,null,0]
[null,null,null,null,null,null,null,null,null,null,null,null,null,0,0,0,0,0,0,0,0,0,0,0,0,0,0,null,0,{"$f":"IF(AC29=1,IF(AC$7=$K29,0,1),IF(AD$7=$J29,1,0))","v":0},0,0,0,0,0,0,0,0,0,0,null,{"$f":"$C29*$F29*SUM(Header!$C$13:$C$15)","v":0},{"$f":"IF($G29>15,15,$G29)*$C29*Header!$C$16","v":0},{"$f":"IF($F29>15,15,$F29)*$C29*Header!$C$17","v":0},{"$f":"IF(Header!$C$12=\"Summer\",SUM($AC29:$AG29),IF(Header!$C$12=\"Autumn\",SUM($AC29:$AF29),IF(Header!$C$12=\"Spring\",SUM($AC29:$AE29),0)))*$I29","v":0},0,null,{"$f":"$D29*$F29*SUM(Header!$D$13:$D$15)","v":0},{"$f":"IF($G29>15,15,$G29)*$D29*Header!$D$16","v":0},{"$f":"IF($F29>15,15,$F29)*$D29*Header!$D$17","v":0},{"$f":"IF(Header!$C$12=\"Summer\",SUM($AH29:$AK29),IF(Header!$C$12=\"Autumn\",SUM($AG29:$AI29),IF(Header!$C$12=\"Spring\",SUM($AF29:$AJ29),0)))*$I29","v":0},0,null,{"$f":"$E29*$F29*SUM(Header!$E$13:$E$15)","v":0},{"$f":"IF($G29>15,15,$G29)*$E29*Header!$E$16","v":0},{"$f":"IF($F29>15,15,$F29)*$E29*Header!$E$17","v":0},{"$f":"IF(Header!$C$12=\"Summer\",SUM($AL29:$AN29),IF(Header!$C$12=\"Autumn\",SUM($AJ29:$AN29),IF(Header!$C$12=\"Spring\",SUM($AK29:$AN29),0)))*$I29","v":0},0,null,0,null,0]
[null,null,null,null,null,null,null,null,null,null,null,null,null,0,0,0,0,0,0,0,0,0,0,0,0,0,0,null,0,{"$f":"IF(AC30=1,IF(AC$7=$K30,0,1),IF(AD$7=$J30,1,0))","v":0},0,0,0,0,0,0,0,0,0,0,null,{"$f":"$C30*$F30*SUM(Header!$C$13:$C$15)","v":0},{"$f":"IF($G30>15,15,$G30)*$C30*Header!$C$16","v":0},{"$f":"IF($F30>15,15,$F30)*$C30*Header!$C$17","v":0},{"$f":"IF(Header!$C$12=\"Summer\",SUM($AC30:$AG30),IF(Header!$C$12=\"Autumn\",SUM($AC30:$AF30),IF(Header!$C$12=\"Spring\",SUM($AC30:$AE30),0)))*$I30","v":0},0,null,{"$f":"$D30*$F30*SUM(Header!$D$13:$D$15)","v":0},{"$f":"IF($G30>15,15,$G30)*$D30*Header!$D$16","v":0},{"$f":"IF($F30>15,15,$F30)*$D30*Header!$D$17","v":0},{"$f":"IF(Header!$C$12=\"Summer\",SUM($AH30:$AK30),IF(Header!$C$12=\"Autumn\",SUM($AG30:$AI30),IF(Header!$C$12=\"Spring\",SUM($AF30:$AJ30),0)))*$I30","v":0},0,null,{"$f":"$E30*$F30*SUM(Header!$E$13:$E$15)","v":0},{"$f":"IF($G30>15,15,$G30)*$E30*Header!$E$16","v":0},{"$f":"IF($F30>15,15,$F30)*$E30*Header!$E$17","v":0},{"$f":"IF(Header!$C$12=\"Summer\",SUM($AL30:$AN30),IF(Header!$C$12=\"Autumn\",SUM($AJ30:$AN30),IF(Header!$C$12=\"Spring\",SUM($AK30:$AN30),0)))*$I30","v":0},0,null,0,null,0]
[null,null,null,null,null,null,null,null,null,null,null,null,null,0,0,0,0,0,0,0,0,0,0,0,0,0,0,null,0,{"$f":"IF(AC31=1,IF(AC$7=$K31,0,1),IF(AD$7=$J31,1,0))","v":0},0,0,0,0,0,0,0,0,0,0,null,{"$f":"$C31*$F31*SUM(Header!$C$13:$C$15)","v":0},{"$f":"IF($G31>15,15,$G31)*$C31*Header!$C$16","v":0},{"$f":"IF($F31>15,15,$F31)*$C31*Header!$C$17","v":0},{"$f":"IF(Header!$C$12=\"Summer\",SUM($AC31:$AG31),IF(Header!$C$12=\"Autumn\",SUM($AC31:$AF31),IF(Header!$C$12=\"Spring\",SUM($AC31:$AE31),0)))*$I31","v":0},0,null,{"$f":"$D31*$F31*SUM(Header!$D$13:$D$15)","v":0},{"$f":"IF($G31>15,15,$G31)*$D31*Header!$D$16","v":0},{"$f":"IF($F31>15,15,$F31)*$D31*Header!$D$17","v":0},{"$f":"IF(Header!$C$12=\"Summer\",SUM($AH31:$AK31),IF(Header!$C$12=\"Autumn\",SUM($AG31:$AI31),IF(Header!$C$12=\"Spring\",SUM($AF31:$AJ31),0)))*$I31","v":0},0,null,{"$f":"$E31*$F31*SUM(Header!$E$13:$E$15)","v":0},{"$f":"IF($G31>15,15,$G31)*$E31*Header!$E$16","v":0},{"$f":"IF($F31>15,15,$F31)*$E31*Header!$E$17","v":0},{"$f":"IF(Header!$C$12=\"Summer\",SUM($AL31:$AN31),IF(Header!$C$12=\"Autumn\",SUM($AJ31:$AN31),IF(Header!$C$12=\"Spring\",SUM($AK31:$AN31),0)))*$I31","v":0},0,null,0,null,0]
[null,null,null,null,null,null,null,null,null,null,null,null,null,0,0,0,0,0,0,0,0,0,0,0,0,0,0,null,0,{"$f":"IF(AC32=1,IF(AC$7=$K32,0,1),IF(AD$7=$J32,1,0))","v":0},0,0,0,0,0,0,0,0,0,0,null,{"$f":"$C32*$F32*SUM(Header!$C$13:$C$15)","v":0},{"$f":"IF($G32>15,15,$G32)*$C32*Header!$C$16","v":0},{"$f":"IF($F32>15,15,$F32)*$C32*Header!$C$17","v":0},{"$f":"IF(Header!$C$12=\"Summer\",SUM($AC32:$AG32),IF(Header!$C$12=\"Autumn\",SUM($AC32:$AF32),IF(Header!$C$12=\"Spring\",SUM($AC32:$AE32),0)))*$I32","v":0},0,null,{"$f":"$D32*$F32*SUM(Header!$D$13:$D$15)","v":0},{"$f":"IF($G32>15,15,$G32)*$D32*Header!$D$16","v":0},{"$f":"IF($F32>15,15,$F32)*$D32*Header!$D$17","v":0},{"$f":"IF(Header!$C$12=\"Summer\",SUM($AH32:$AK32),IF(Header!$C$12=\"Autumn\",SUM($AG32:$AI32),IF(Header!$C$12=\"Spring\",SUM($AF32:$AJ32),0)))*$I32","v":0},0,null,{"$f":"$E32*$F32*SUM(Header!$E$13:$E$15)","v":0},{"$f":"IF($G32>15,15,$G32)*$E32*Header!$E$16","v":0},{"$f":"IF($F32>15,15,$F32)*$E32*Header!$E$17","v":0},{"$f":"IF(Header!$C$12=\"Summer\",SUM($AL32:$AN32),IF(Header!$C$12=\"Autumn\",SUM($AJ32:$AN32),IF(Header!$C$12=\"Spring\",SUM($AK32:$AN32),0)))*$I32","v":0},0,null,0,null,0]
[null,null,null,null,null,null,null,null,null,null,null,null,null,0,0,0,0,0,0,0,0,0,0,0,0,0,0,null,0,{"$f":"IF(AC33=1,IF(AC$7=$K33,0,1),IF(AD$7=$J33,1,0))","v":0},0,0,0,0,0,0,0,0,0,0,null,{"$f":"$C33*$F33*SUM(Header!$C$13:$C$15)","v":0},{"$f":"IF($G33>15,15,$G33)*$C33*Header!$C$16","v":0},{"$f":"IF($F33>15,15,$F33)*$C33*Header!$C$17","v":0},{"$f":"IF(Header!$C$12=\"Summer\",SUM($AC33:$AG33),IF(Header!$C$12=\"Autumn\",SUM($AC33:$AF33),IF(Header!$C$12=\"Spring\",SUM($AC33:$AE33),0)))*$I33","v":0},0,null,{"$f":"$D33*$F33*SUM(Header!$D$13:$D$15)","v":0},{"$f":"IF($G33>15,15,$G33)*$D33*Header!$D$16","v":0},{"$f":"IF($F33>15,15,$F33)*$D33*Header!$D$17","v":0},{"$f":"IF(Header!$C$12=\"Summer\",SUM($AH33:$AK33),IF(Header!$C$12=\"Autumn\",SUM($AG33:$AI33),IF(Header!$C$12=\"Spring\",SUM($AF33:$AJ33),0)))*$I33","v":0},0,null,{"$f":"$E33*$F33*SUM(Header!$E$13:$E$15)","v":0},{"$f":"IF($G33>15,15,$G33)*$E33*Header!$E$16","v":0},{"$f":"IF($F33>15,15,$F33)*$E33*Header!$E$17","v":0},{"$f":"IF(Header!$C$12=\"Summer\",SUM($AL33:$AN33),IF(Header!$C$12=\"Autumn\",SUM($AJ33:$AN33),IF(Header!$C$12=\"Spring\",SUM($AK33:$AN33),0)))*$I33","v":0},0,null,0,null,0]
[null,null,null,null,null,null,null,null,null,null,null,null,null,0,0,0,0,0,0,0,0,0,0,0,0,0,0,null,0,{"$f":"IF(AC34=1,IF(AC$7=$K34,0,1),IF(AD$7=$J34,1,0))","v":0},0,0,0,0,0,0,0,0,0,0,null,{"$f":"$C34*$F34*SUM(Header!$C$13:$C$15)","v":0},{"$f":"IF($G34>15,15,$G34)*$C34*Header!$C$16","v":0},{"$f":"IF($F34>15,15,$F34)*$C34*Header!$C$17","v":0},{"$f":"IF(Header!$C$12=\"Summer\",SUM($AC34:$AG34),IF(Header!$C$12=\"Autumn\",SUM($AC34:$AF34),IF(Header!$C$12=\"Spring\",SUM($AC34:$AE34),0)))*$I34","v":0},0,null,{"$f":"$D34*$F34*SUM(Header!$D$13:$D$15)","v":0},{"$f":"IF($G34>15,15,$G34)*$D34*Header!$D$16","v":0},{"$f":"IF($F34>15,15,$F34)*$D34*Header!$D$17","v":0},{"$f":"IF(Header!$C$12=\"Summer\",SUM($AH34:$AK34),IF(Header!$C$12=\"Autumn\",SUM($AG34:$AI34),IF(Header!$C$12=\"Spring\",SUM($AF34:$AJ34),0)))*$I34","v":0},0,null,{"$f":"$E34*$F34*SUM(Header!$E$13:$E$15)","v":0},{"$f":"IF($G34>15,15,$G34)*$E34*Header!$E$16","v":0},{"$f":"IF($F34>15,15,$F34)*$E34*Header!$E$17","v":0},{"$f":"IF(Header!$C$12=\"Summer\",SUM($AL34:$AN34),IF(Header!$C$12=\"Autumn\",SUM($AJ34:$AN34),IF(Header!$C$12=\"Spring\",SUM($AK34:$AN34),0)))*$I34","v":0},0,null,0,null,0]
[null,null,null,null,null,null,null,null,null,null,null,null,null,0,0,0,0,0,0,0,0,0,0,0,0,0,0,null,0,{"$f":"IF(AC35=1,IF(AC$7=$K35,0,1),IF(AD$7=$J35,1,0))","v":0},0,0,0,0,0,0,0,0,0,0,null,{"$f":"$C35*$F35*SUM(Header!$C$13:$C$15)","v":0},{"$f":"IF($G35>15,15,$G35)*$C35*Header!$C$16","v":0},{"$f":"IF($F35>15,15,$F35)*$C35*Header!$C$17","v":0},{"$f":"IF(Header!$C$12=\"Summer\",SUM($AC35:$AG35),IF(Header!$C$12=\"Autumn\",SUM($AC35:$AF35),IF(Header!$C$12=\"Spring\",SUM($AC35:$AE35),0)))*$I35","v":0},0,null,{"$f":"$D35*$F35*SUM(Header!$D$13:$D$15)","v":0},{"$f":"IF($G35>15,15,$G35)*$D35*Header!$D$16","v":0},{"$f":"IF($F35>15,15,$F35)*$D35*Header!$D$17","v":0},{"$f":"IF(Header!$C$12=\"Summer\",SUM($AH35:$AK35),IF(Header!$C$12=\"Autumn\",SUM($AG35:$AI35),IF(Header!$C$12=\"Spring\",SUM($AF35:$AJ35),0)))*$I35","v":0},0,null,{"$f":"$E35*$F35*SUM(Header!$E$13:$E$15)","v":0},{"$f":"IF($G35>15,15,$G35)*$E35*Header!$E$16","v":0},{"$f":"IF($F35>15,15,$F35)*$E35*Header!$E$17","v":0},{"$f":"IF(Header!$C$12=\"Summer\",SUM($AL35:$AN35),IF(Header!$C$12=\"Autumn\",SUM($AJ35:$AN35),IF(Header!$C$12=\"Spring\",SUM($AK35:$AN35),0)))*$I35","v":0},0,null,0,null,0]
[null,null,null,null,null,null,null,null,null,null,null,null,null,0,0,0,0,0,0,0,0,0,0,0,0,0,0,null,0,{"$f":"IF(AC36=1,IF(AC$7=$K36,0,1),IF(AD$7=$J36,1,0))","v":0},0,0,0,0,0,0,0,0,0,0,null,{"$f":"$C36*$F36*SUM(Header!$C$13:$C$15)","v":0},{"$f":"IF($G36>15,15,$G36)*$C36*Header!$C$16","v":0},{"$f":"IF($F36>15,15,$F36)*$C36*Header!$C$17","v":0},{"$f":"IF(Header!$C$12=\"Summer\",SUM($AC36:$AG36),IF(Header!$C$12=\"Autumn\",SUM($AC36:$AF36),IF(Header!$C$12=\"Spring\",SUM($AC36:$AE36),0)))*$I36","v":0},0,null,{"$f":"$D36*$F36*SUM(Header!$D$13:$D$15)","v":0},{"$f":"IF($G36>15,15,$G36)*$D36*Header!$D$16","v":0},{"$f":"IF($F36>15,15,$F36)*$D36*Header!$D$17","v":0},{"$f":"IF(Header!$C$12=\"Summer\",SUM($AH36:$AK36),IF(Header!$C$12=\"Autumn\",SUM($AG36:$AI36),IF(Header!$C$12=\"Spring\",SUM($AF36:$AJ36),0)))*$I36","v":0},0,null,{"$f":"$E36*$F36*SUM(Header!$E$13:$E$15)","v":0},{"$f":"IF($G36>15,15,$G36)*$E36*Header!$E$16","v":0},{"$f":"IF($F36>15,15,$F36)*$E36*Header!$E$17","v":0},{"$f":"IF(Header!$C$12=\"Summer\",SUM($AL36:$AN36),IF(Header!$C$12=\"Autumn\",SUM($AJ36:$AN36),IF(Header!$C$12=\"Spring\",SUM($AK36:$AN36),0)))*$I36","v":0},0,null,0,null,0]
[null,null,null,null,null,null,null,null,null,null,null,null,null,0,0,0,0,0,0,0,0,0,0,0,0,0,0,null,0,{"$f":"IF(AC37=1,IF(AC$7=$K37,0,1),IF(AD$7=$J37,1,0))","v":0},0,0,0,0,0,0,0,0,0,0,null,{"$f":"$C37*$F37*SUM(Header!$C$13:$C$15)","v":0},{"$f":"IF($G37>15,15,$G37)*$C37*Header!$C$16","v":0},{"$f":"IF($F37>15,15,$F37)*$C37*Header!$C$17","v":0},{"$f":"IF(Header!$C$12=\"Summer\",SUM($AC37:$AG37),IF(Header!$C$12=\"Autumn\",SUM($AC37:$AF37),IF(Header!$C$12=\"Spring\",SUM($AC37:$AE37),0)))*$I37","v":0},0,null,{"$f":"$D37*$F37*SUM(Header!$D$13:$D$15)","v":0},{"$f":"IF($G37>15,15,$G37)*$D37*Header!$D$16","v":0},{"$f":"IF($F37>15,15,$F37)*$D37*Header!$D$17","v":0},{"$f":"IF(Header!$C$12=\"Summer\",SUM($AH37:$AK37),IF(Header!$C$12=\"Autumn\",SUM($AG37:$AI37),IF(Header!$C$12=\"Spring\",SUM($AF37:$AJ37),0)))*$I37","v":0},0,null,{"$f":"$E37*$F37*SUM(Header!$E$13:$E$15)","v":0},{"$f":"IF($G37>15,15,$G37)*$E37*Header!$E$16","v":0},{"$f":"IF($F37>15,15,$F37)*$E37*Header!$E$17","v":0},{"$f":"IF(Header!$C$12=\"Summer\",SUM($AL37:$AN37),IF(Header!$C$12=\"Autumn\",SUM($AJ37:$AN37),IF(Header!$C$12=\"Spring\",SUM($AK37:$AN37),0)))*$I37","v":0},0,null,0,null,0]
[null,null,null,null,null,null,null,null,null,null,null,null,null,0,0,0,0,0,0,0,0,0,0,0,0,0,0,null,0,{"$f":"IF(AC38=1,IF(AC$7=$K38,0,1),IF(AD$7=$J38,1,0))","v":0},0,0,0,0,0,0,0,0,0,0,null,{"$f":"$C38*$F38*SUM(Header!$C$13:$C$15)","v":0},{"$f":"IF($G38>15,15,$G38)*$C38*Header!$C$16","v":0},{"$f":"IF($F38>15,15,$F38)*$C38*Header!$C$17","v":0},{"$f":"IF(Header!$C$12=\"Summer\",SUM($AC38:$AG38),IF(Header!$C$12=\"Autumn\",SUM($AC38:$AF38),IF(Header!$C$12=\"Spring\",SUM($AC38:$AE38),0)))*$I38","v":0},0,null,{"$f":"$D38*$F38*SUM(Header!$D$13:$D$15)","v":0},{"$f":"IF($G38>15,15,$G38)*$D38*Header!$D$16","v":0},{"$f":"IF($F38>15,15,$F38)*$D38*Header!$D$17","v":0},{"$f":"IF(Header!$C$12=\"Summer\",SUM($AH38:$AK38),IF(Header!$C$12=\"Autumn\",SUM($AG38:$AI38),IF(Header!$C$12=\"Spring\",SUM($AF38:$AJ38),0)))*$I38","v":0},0,null,{"$f":"$E38*$F38*SUM(Header!$E$13:$E$15)","v":0},{"$f":"IF($G38>15,15,$G38)*$E38*Header!$E$16","v":0},{"$f":"IF($F38>15,15,$F38)*$E38*Header!$E$17","v":0},{"$f":"IF(Header!$C$12=\"Summer\",SUM($AL38:$AN38),IF(Header!$C$12=\"Autumn\",SUM($AJ38:$AN38),IF(Header!$C$12=\"Spring\",SUM($AK38:$AN38),0)))*$I38","v":0},0,null,0,null,0]
[null,null,null,null,null,null,null,null,null,null,null,null,null,0,0,0,0,0,0,0,0,0,0,0,0,0,0,null,0,{"$f":"IF(AC39=1,IF(AC$7=$K39,0,1),IF(AD$7=$J39,1,0))","v":0},0,0,0,0,0,0,0,0,0,0,null,{"$f":"$C39*$F39*SUM(Header!$C$13:$C$15)","v":0},{"$f":"IF($G39>15,15,$G39)*$C39*Header!$C$16","v":0},{"$f":"IF($F39>15,15,$F39)*$C39*Header!$C$17","v":0},{"$f":"IF(Header!$C$12=\"Summer\",SUM($AC39:$AG39),IF(Header!$C$12=\"Autumn\",SUM($AC39:$AF39),IF(Header!$C$12=\"Spring\",SUM($AC39:$AE39),0)))*$I39","v":0},0,null,{"$f":"$D39*$F39*SUM(Header!$D$13:$D$15)","v":0},{"$f":"IF($G39>15,15,$G39)*$D39*Header!$D$16","v":0},{"$f":"IF($F39>15,15,$F39)*$D39*Header!$D$17","v":0},{"$f":"IF(Header!$C$12=\"Summer\",SUM($AH39:$AK39),IF(Header!$C$12=\"Autumn\",SUM($AG39:$AI39),IF(Header!$C$12=\"Spring\",SUM($AF39:$AJ39),0)))*$I39","v":0},0,null,{"$f":"$E39*$F39*SUM(Header!$E$13:$E$15)","v":0},{"$f":"IF($G39>15,15,$G39)*$E39*Header!$E$16","v":0},{"$f":"IF($F39>15,15,$F39)*$E39*Header!$E$17","v":0},{"$f":"IF(Header!$C$12=\"Summer\",SUM($AL39:$AN39),IF(Header!$C$12=\"Autumn\",SUM($AJ39:$AN39),IF(Header!$C$12=\"Spring\",SUM($AK39:$AN39),0)))*$I39","v":0},0,null,0,null,0]
[null,null,null,null,null,null,null,null,null,null,null,null,null,0,0,0,0,0,0,0,0,0,0,0,0,0,0,null,0,{"$f":"IF(AC40=1,IF(AC$7=$K40,0,1),IF(AD$7=$J40,1,0))","v":0},0,0,0,0,0,0,0,0,0,0,null,{"$f":"$C40*$F40*SUM(Header!$C$13:$C$15)","v":0},{"$f":"IF($G40>15,15,$G40)*$C40*Header!$C$16","v":0},{"$f":"IF($F40>15,15,$F40)*$C40*Header!$C$17","v":0},{"$f":"IF(Header!$C$12=\"Summer\",SUM($AC40:$AG40),IF(Header!$C$12=\"Autumn\",SUM($AC40:$AF40),IF(Header!$C$12=\"Spring\",SUM($AC40:$AE40),0)))*$I40","v":0},0,null,{"$f":"$D40*$F40*SUM(Header!$D$13:$D$15)","v":0},{"$f":"IF($G40>15,15,$G40)*$D40*Header!$D$16","v":0},{"$f":"IF($F40>15,15,$F40)*$D40*Header!$D$17","v":0},{"$f":"IF(Header!$C$12=\"Summer\",SUM($AH40:$AK40),IF(Header!$C$12=\"Autumn\",SUM($AG40:$AI40),IF(Header!$C$12=\"Spring\",SUM($AF40:$AJ40),0)))*$I40","v":0},0,null,{"$f":"$E40*$F40*SUM(Header!$E$13:$E$15)","v":0},{"$f":"IF($G40>15,15,$G40)*$E40*Header!$E$16","v":0},{"$f":"IF($F40>15,15,$F40)*$E40*Header!$E$17","v":0},{"$f":"IF(Header!$C$12=\"Summer\",SUM($AL40:$AN40),IF(Header!$C$12=\"Autumn\",SUM($AJ40:$AN40),IF(Header!$C$12=\"Spring\",SUM($AK40:$AN40),0)))*$I40","v":0},0,null,0,null,0]
[null,null,null,null,null,null,null,null,null,null,null,null,null,0,0,0,0,0,0,0,0,0,0,0,0,0,0,null,0,{"$f":"IF(AC41=1,IF(AC$7=$K41,0,1),IF(AD$7=$J41,1,0))","v":0},0,0,0,0,0,0,0,0,0,0,null,{"$f":"$C41*$F41*SUM(Header!$C$13:$C$15)","v":0},{"$f":"IF($G41>15,15,$G41)*$C41*Header!$C$16","v":0},{"$f":"IF($F41>15,15,$F41)*$C41*Header!$C$17","v":0},{"$f":"IF(Header!$C$12=\"Summer\",SUM($AC41:$AG41),IF(Header!$C$12=\"Autumn\",SUM($AC41:$AF41),IF(Header!$C$12=\"Spring\",SUM($AC41:$AE41),0)))*$I41","v":0},0,null,{"$f":"$D41*$F41*SUM(Header!$D$13:$D$15)","v":0},{"$f":"IF($G41>15,15,$G41)*$D41*Header!$D$16","v":0},{"$f":"IF($F41>15,15,$F41)*$D41*Header!$D$17","v":0},{"$f":"IF(Header!$C$12=\"Summer\",SUM($AH41:$AK41),IF(Header!$C$12=\"Autumn\",SUM($AG41:$AI41),IF(Header!$C$12=\"Spring\",SUM($AF41:$AJ41),0)))*$I41","v":0},0,null,{"$f":"$E41*$F41*SUM(Header!$E$13:$E$15)","v":0},{"$f":"IF($G41>15,15,$G41)*$E41*Header!$E$16","v":0},{"$f":"IF($F41>15,15,$F41)*$E41*Header!$E$17","v":0},{"$f":"IF(Header!$C$12=\"Summer\",SUM($AL41:$AN41),IF(Header!$C$12=\"Autumn\",SUM($AJ41:$AN41),IF(Header!$C$12=\"Spring\",SUM($AK41:$AN41),0)))*$I41","v":0},0,null,0,null,0]
[null,null,null,null,null,null,null,null,null,null,null,null,null,0,0,0,0,0,0,0,0,0,0,0,0,0,0,null,0,{"$f":"IF(AC42=1,IF(AC$7=$K42,0,1),IF(AD$7=$J42,1,0))","v":0},0,0,0,0,0,0,0,0,0,0,null,{"$f":"$C42*$F42*SUM(Header!$C$13:$C$15)","v":0},{"$f":"IF($G42>15,15,$G42)*$C42*Header!$C$16","v":0},{"$f":"IF($F42>15,15,$F42)*$C42*Header!$C$17","v":0},{"$f":"IF(Header!$C$12=\"Summer\",SUM($AC42:$AG42),IF(Header!$C$12=\"Autumn\",SUM($AC42:$AF42),IF(Header!$C$12=\"Spring\",SUM($AC42:$AE42),0)))*$I42","v":0},0,null,{"$f":"$D42*$F42*SUM(Header!$D$13:$D$15)","v":0},{"$f":"IF($G42>15,15,$G42)*$D42*Header!$D$16","v":0},{"$f":"IF($F42>15,15,$F42)*$D42*Header!$D$17","v":0},{"$f":"IF(Header!$C$12=\"Summer\",SUM($AH42:$AK42),IF(Header!$C$12=\"Autumn\",SUM($AG42:$AI42),IF(Header!$C$12=\"Spring\",SUM($AF42:$AJ42),0)))*$I42","v":0},0,null,{"$f":"$E42*$F42*SUM(Header!$E$13:$E$15)","v":0},{"$f":"IF($G42>15,15,$G42)*$E42*Header!$E$16","v":0},{"$f":"IF($F42>15,15,$F42)*$E42*Header!$E$17","v":0},{"$f":"IF(Header!$C$12=\"Summer\",SUM($AL42:$AN42),IF(Header!$C$12=\"Autumn\",SUM($AJ42:$AN42),IF(Header!$C$12=\"Spring\",SUM($AK42:$AN42),0)))*$I42","v":0},0,null,0,null,0]
[null,null,null,null,null,null,null,null,null,null,null,null,null,0,0,0,0,0,0,0,0,0,0,0,0,0,0,null,0,{"$f":"IF(AC43=1,IF(AC$7=$K43,0,1),IF(AD$7=$J43,1,0))","v":0},0,0,0,0,0,0,0,0,0,0,null,{"$f":"$C43*$F43*SUM(Header!$C$13:$C$15)","v":0},{"$f":"IF($G43>15,15,$G43)*$C43*Header!$C$16","v":0},{"$f":"IF($F43>15,15,$F43)*$C43*Header!$C$17","v":0},{"$f":"IF(Header!$C$12=\"Summer\",SUM($AC43:$AG43),IF(Header!$C$12=\"Autumn\",SUM($AC43:$AF43),IF(Header!$C$12=\"Spring\",SUM($AC43:$AE43),0)))*$I43","v":0},0,null,{"$f":"$D43*$F43*SUM(Header!$D$13:$D$15)","v":0},{"$f":"IF($G43>15,15,$G43)*$D43*Header!$D$16","v":0},{"$f":"IF($F43>15,15,$F43)*$D43*Header!$D$17","v":0},{"$f":"IF(Header!$C$12=\"Summer\",SUM($AH43:$AK43),IF(Header!$C$12=\"Autumn\",SUM($AG43:$AI43),IF(Header!$C$12=\"Spring\",SUM($AF43:$AJ43),0)))*$I43","v":0},0,null,{"$f":"$E43*$F43*SUM(Header!$E$13:$E$15)","v":0},{"$f":"IF($G43>15,15,$G43)*$E43*Header!$E$16","v":0},{"$f":"IF($F43>15,15,$F43)*$E43*Header!$E$17","v":0},{"$f":"IF(Header!$C$12=\"Summer\",SUM($AL43:$AN43),IF(Header!$C$12=\"Autumn\",SUM($AJ43:$AN43),IF(Header!$C$12=\"Spring\",SUM($AK43:$AN43),0)))*$I43","v":0},0,null,0,null,0]
[null,null,null,null,null,null,null,null,null,null,null,null,null,0,0,0,0,0,0,0,0,0,0,0,0,0,0,null,0,{"$f":"IF(AC44=1,IF(AC$7=$K44,0,1),IF(AD$7=$J44,1,0))","v":0},0,0,0,0,0,0,0,0,0,0,null,{"$f":"$C44*$F44*SUM(Header!$C$13:$C$15)","v":0},{"$f":"IF($G44>15,15,$G44)*$C44*Header!$C$16","v":0},{"$f":"IF($F44>15,15,$F44)*$C44*Header!$C$17","v":0},{"$f":"IF(Header!$C$12=\"Summer\",SUM($AC44:$AG44),IF(Header!$C$12=\"Autumn\",SUM($AC44:$AF44),IF(Header!$C$12=\"Spring\",SUM($AC44:$AE44),0)))*$I44","v":0},0,null,{"$f":"$D44*$F44*SUM(Header!$D$13:$D$15)","v":0},{"$f":"IF($G44>15,15,$G44)*$D44*Header!$D$16","v":0},{"$f":"IF($F44>15,15,$F44)*$D44*Header!$D$17","v":0},{"$f":"IF(Header!$C$12=\"Summer\",SUM($AH44:$AK44),IF(Header!$C$12=\"Autumn\",SUM($AG44:$AI44),IF(Header!$C$12=\"Spring\",SUM($AF44:$AJ44),0)))*$I44","v":0},0,null,{"$f":"$E44*$F44*SUM(Header!$E$13:$E$15)","v":0},{"$f":"IF($G44>15,15,$G44)*$E44*Header!$E$16","v":0},{"$f":"IF($F44>15,15,$F44)*$E44*Header!$E$17","v":0},{"$f":"IF(Header!$C$12=\"Summer\",SUM($AL44:$AN44),IF(Header!$C$12=\"Autumn\",SUM($AJ44:$AN44),IF(Header!$C$12=\"Spring\",SUM($AK44:$AN44),0)))*$I44","v":0},0,null,0,null,0]
[null,null,null,null,null,null,null,null,null,null,null,null,null,0,0,0,0,0,0,0,0,0,0,0,0,0,0,null,0,{"$f":"IF(AC45=1,IF(AC$7=$K45,0,1),IF(AD$7=$J45,1,0))","v":0},0,0,0,0,0,0,0,0,0,0,null,{"$f":"$C45*$F45*SUM(Header!$C$13:$C$15)","v":0},{"$f":"IF($G45>15,15,$G45)*$C45*Header!$C$16","v":0},{"$f":"IF($F45>15,15,$F45)*$C45*Header!$C$17","v":0},{"$f":"IF(Header!$C$12=\"Summer\",SUM($AC45:$AG45),IF(Header!$C$12=\"Autumn\",SUM($AC45:$AF45),IF(Header!$C$12=\"Spring\",SUM($AC45:$AE45),0)))*$I45","v":0},0,null,{"$f":"$D45*$F45*SUM(Header!$D$13:$D$15)","v":0},{"$f":"IF($G45>15,15,$G45)*$D45*Header!$D$16","v":0},{"$f":"IF($F45>15,15,$F45)*$D45*Header!$D$17","v":0},{"$f":"IF(Header!$C$12=\"Summer\",SUM($AH45:$AK45),IF(Header!$C$12=\"Autumn\",SUM($AG45:$AI45),IF(Header!$C$12=\"Spring\",SUM($AF45:$AJ45),0)))*$I45","v":0},0,null,{"$f":"$E45*$F45*SUM(Header!$E$13:$E$15)","v":0},{"$f":"IF($G45>15,15,$G45)*$E45*Header!$E$16","v":0},{"$f":"IF($F45>15,15,$F45)*$E45*Header!$E$17","v":0},{"$f":"IF(Header!$C$12=\"Summer\",SUM($AL45:$AN45),IF(Header!$C$12=\"Autumn\",SUM($AJ45:$AN45),IF(Header!$C$12=\"Spring\",SUM($AK45:$AN45),0)))*$I45","v":0},0,null,0,null,0]
[null,null,null,null,null,null,null,null,null,null,null,null,null,0,0,0,0,0,0,0,0,0,0,0,0,0,0,null,0,{"$f":"IF(AC46=1,IF(AC$7=$K46,0,1),IF(AD$7=$J46,1,0))","v":0},0,0,0,0,0,0,0,0,0,0,null,{"$f":"$C46*$F46*SUM(Header!$C$13:$C$15)","v":0},{"$f":"IF($G46>15,15,$G46)*$C46*Header!$C$16","v":0},{"$f":"IF($F46>15,15,$F46)*$C46*Header!$C$17","v":0},{"$f":"IF(Header!$C$12=\"Summer\",SUM($AC46:$AG46),IF(Header!$C$12=\"Autumn\",SUM($AC46:$AF46),IF(Header!$C$12=\"Spring\",SUM($AC46:$AE46),0)))*$I46","v":0},0,null,{"$f":"$D46*$F46*SUM(Header!$D$13:$D$15)","v":0},{"$f":"IF($G46>15,15,$G46)*$D46*Header!$D$16","v":0},{"$f":"IF($F46>15,15,$F46)*$D46*Header!$D$17","v":0},{"$f":"IF(Header!$C$12=\"Summer\",SUM($AH46:$AK46),IF(Header!$C$12=\"Autumn\",SUM($AG46:$AI46),IF(Header!$C$12=\"Spring\",SUM($AF46:$AJ46),0)))*$I46","v":0},0,null,{"$f":"$E46*$F46*SUM(Header!$E$13:$E$15)","v":0},{"$f":"IF($G46>15,15,$G46)*$E46*Header!$E$16","v":0},{"$f":"IF($F46>15,15,$F46)*$E46*Header!$E$17","v":0},{"$f":"IF(Header!$C$12=\"Summer\",SUM($AL46:$AN46),IF(Header!$C$12=\"Autumn\",SUM($AJ46:$AN46),IF(Header!$C$12=\"Spring\",SUM($AK46:$AN46),0)))*$I46","v":0},0,null,0,null,0]
[null,null,null,null,null,null,null,null,null,null,null,null,null,0,0,0,0,0,0,0,0,0,0,0,0,0,0,null,0,{"$f":"IF(AC47=1,IF(AC$7=$K47,0,1),IF(AD$7=$J47,1,0))","v":0},0,0,0,0,0,0,0,0,0,0,null,{"$f":"$C47*$F47*SUM(Header!$C$13:$C$15)","v":0},{"$f":"IF($G47>15,15,$G47)*$C47*Header!$C$16","v":0},{"$f":"IF($F47>15,15,$F47)*$C47*Header!$C$17","v":0},{"$f":"IF(Header!$C$12=\"Summer\",SUM($AC47:$AG47),IF(Header!$C$12=\"Autumn\",SUM($AC47:$AF47),IF(Header!$C$12=\"Spring\",SUM($AC47:$AE47),0)))*$I47","v":0},0,null,{"$f":"$D47*$F47*SUM(Header!$D$13:$D$15)","v":0},{"$f":"IF($G47>15,15,$G47)*$D47*Header!$D$16","v":0},{"$f":"IF($F47>15,15,$F47)*$D47*Header!$D$17","v":0},{"$f":"IF(Header!$C$12=\"Summer\",SUM($AH47:$AK47),IF(Header!$C$12=\"Autumn\",SUM($AG47:$AI47),IF(Header!$C$12=\"Spring\",SUM($AF47:$AJ47),0)))*$I47","v":0},0,null,{"$f":"$E47*$F47*SUM(Header!$E$13:$E$15)","v":0},{"$f":"IF($G47>15,15,$G47)*$E47*Header!$E$16","v":0},{"$f":"IF($F47>15,15,$F47)*$E47*Header!$E$17","v":0},{"$f":"IF(Header!$C$12=\"Summer\",SUM($AL47:$AN47),IF(Header!$C$12=\"Autumn\",SUM($AJ47:$AN47),IF(Header!$C$12=\"Spring\",SUM($AK47:$AN47),0)))*$I47","v":0},0,null,0,null,0]
[null,null,null,null,null,null,null,null,null,null,null,null,null,0,0,0,0,0,0,0,0,0,0,0,0,0,0,null,0,{"$f":"IF(AC48=1,IF(AC$7=$K48,0,1),IF(AD$7=$J48,1,0))","v":0},0,0,0,0,0,0,0,0,0,0,null,{"$f":"$C48*$F48*SUM(Header!$C$13:$C$15)","v":0},{"$f":"IF($G48>15,15,$G48)*$C48*Header!$C$16","v":0},{"$f":"IF($F48>15,15,$F48)*$C48*Header!$C$17","v":0},{"$f":"IF(Header!$C$12=\"Summer\",SUM($AC48:$AG48),IF(Header!$C$12=\"Autumn\",SUM($AC48:$AF48),IF(Header!$C$12=\"Spring\",SUM($AC48:$AE48),0)))*$I48","v":0},0,null,{"$f":"$D48*$F48*SUM(Header!$D$13:$D$15)","v":0},{"$f":"IF($G48>15,15,$G48)*$D48*Header!$D$16","v":0},{"$f":"IF($F48>15,15,$F48)*$D48*Header!$D$17","v":0},{"$f":"IF(Header!$C$12=\"Summer\",SUM($AH48:$AK48),IF(Header!$C$12=\"Autumn\",SUM($AG48:$AI48),IF(Header!$C$12=\"Spring\",SUM($AF48:$AJ48),0)))*$I48","v":0},0,null,{"$f":"$E48*$F48*SUM(Header!$E$13:$E$15)","v":0},{"$f":"IF($G48>15,15,$G48)*$E48*Header!$E$16","v":0},{"$f":"IF($F48>15,15,$F48)*$E48*Header!$E$17","v":0},{"$f":"IF(Header!$C$12=\"Summer\",SUM($AL48:$AN48),IF(Header!$C$12=\"Autumn\",SUM($AJ48:$AN48),IF(Header!$C$12=\"Spring\",SUM($AK48:$AN48),0)))*$I48","v":0},0,null,0,null,0]
[null,null,null,null,null,null,null,null,null,null,null,null,null,0,0,0,0,0,0,0,0,0,0,0,0,0,0,null,0,{"$f":"IF(AC49=1,IF(AC$7=$K49,0,1),IF(AD$7=$J49,1,0))","v":0},0,0,0,0,0,0,0,0,0,0,null,{"$f":"$C49*$F49*SUM(Header!$C$13:$C$15)","v":0},{"$f":"IF($G49>15,15,$G49)*$C49*Header!$C$16","v":0},{"$f":"IF($F49>15,15,$F49)*$C49*Header!$C$17","v":0},{"$f":"IF(Header!$C$12=\"Summer\",SUM($AC49:$AG49),IF(Header!$C$12=\"Autumn\",SUM($AC49:$AF49),IF(Header!$C$12=\"Spring\",SUM($AC49:$AE49),0)))*$I49","v":0},0,null,{"$f":"$D49*$F49*SUM(Header!$D$13:$D$15)","v":0},{"$f":"IF($G49>15,15,$G49)*$D49*Header!$D$16","v":0},{"$f":"IF($F49>15,15,$F49)*$D49*Header!$D$17","v":0},{"$f":"IF(Header!$C$12=\"Summer\",SUM($AH49:$AK49),IF(Header!$C$12=\"Autumn\",SUM($AG49:$AI49),IF(Header!$C$12=\"Spring\",SUM($AF49:$AJ49),0)))*$I49","v":0},0,null,{"$f":"$E49*$F49*SUM(Header!$E$13:$E$15)","v":0},{"$f":"IF($G49>15,15,$G49)*$E49*Header!$E$16","v":0},{"$f":"IF($F49>15,15,$F49)*$E49*Header!$E$17","v":0},{"$f":"IF(Header!$C$12=\"Summer\",SUM($AL49:$AN49),IF(Header!$C$12=\"Autumn\",SUM($AJ49:$AN49),IF(Header!$C$12=\"Spring\",SUM($AK49:$AN49),0)))*$I49","v":0},0,null,0,null,0]
[null,null,null,null,null,null,null,null,null,null,null,null,null,0,0,0,0,0,0,0,0,0,0,0,0,0,0,null,0,{"$f":"IF(AC50=1,IF(AC$7=$K50,0,1),IF(AD$7=$J50,1,0))","v":0},0,0,0,0,0,0,0,0,0,0,null,{"$f":"$C50*$F50*SUM(Header!$C$13:$C$15)","v":0},{"$f":"IF($G50>15,15,$G50)*$C50*Header!$C$16","v":0},{"$f":"IF($F50>15,15,$F50)*$C50*Header!$C$17","v":0},{"$f":"IF(Header!$C$12=\"Summer\",SUM($AC50:$AG50),IF(Header!$C$12=\"Autumn\",SUM($AC50:$AF50),IF(Header!$C$12=\"Spring\",SUM($AC50:$AE50),0)))*$I50","v":0},0,null,{"$f":"$D50*$F50*SUM(Header!$D$13:$D$15)","v":0},{"$f":"IF($G50>15,15,$G50)*$D50*Header!$D$16","v":0},{"$f":"IF($F50>15,15,$F50)*$D50*Header!$D$17","v":0},{"$f":"IF(Header!$C$12=\"Summer\",SUM($AH50:$AK50),IF(Header!$C$12=\"Autumn\",SUM($AG50:$AI50),IF(Header!$C$12=\"Spring\",SUM($AF50:$AJ50),0)))*$I50","v":0},0,null,{"$f":"$E50*$F50*SUM(Header!$E$13:$E$15)","v":0},{"$f":"IF($G50>15,15,$G50)*$E50*Header!$E$16","v":0},{"$f":"IF($F50>15,15,$F50)*$E50*Header!$E$17","v":0},{"$f":"IF(Header!$C$12=\"Summer\",SUM($AL50:$AN50),IF(Header!$C$12=\"Autumn\",SUM($AJ50:$AN50),IF(Header!$C$12=\"Spring\",SUM($AK50:$AN50),0)))*$I50","v":0},0,null,0,null,0]
[null,null,null,null,null,null,null,null,null,null,null,null,null,0,0,0,0,0,0,0,0,0,0,0,0,0,0,null,0,{"$f":"IF(AC51=1,IF(AC$7=$K51,0,1),IF(AD$7=$J51,1,0))","v":0},0,0,0,0,0,0,0,0,0,0,null,{"$f":"$C51*$F51*SUM(Header!$C$13:$C$15)","v":0},{"$f":"IF($G51>15,15,$G51)*$C51*Header!$C$16","v":0},{"$f":"IF($F51>15,15,$F51)*$C51*Header!$C$17","v":0},{"$f":"IF(Header!$C$12=\"Summer\",SUM($AC51:$AG51),IF(Header!$C$12=\"Autumn\",SUM($AC51:$AF51),IF(Header!$C$12=\"Spring\",SUM($AC51:$AE51),0)))*$I51","v":0},0,null,{"$f":"$D51*$F51*SUM(Header!$D$13:$D$15)","v":0},{"$f":"IF($G51>15,15,$G51)*$D51*Header!$D$16","v":0},{"$f":"IF($F51>15,15,$F51)*$D51*Header!$D$17","v":0},{"$f":"IF(Header!$C$12=\"Summer\",SUM($AH51:$AK51),IF(Header!$C$12=\"Autumn\",SUM($AG51:$AI51),IF(Header!$C$12=\"Spring\",SUM($AF51:$AJ51),0)))*$I51","v":0},0,null,{"$f":"$E51*$F51*SUM(Header!$E$13:$E$15)","v":0},{"$f":"IF($G51>15,15,$G51)*$E51*Header!$E$16","v":0},{"$f":"IF($F51>15,15,$F51)*$E51*Header!$E$17","v":0},{"$f":"IF(Header!$C$12=\"Summer\",SUM($AL51:$AN51),IF(Header!$C$12=\"Autumn\",SUM($AJ51:$AN51),IF(Header!$C$12=\"Spring\",SUM($AK51:$AN51),0)))*$I51","v":0},0,null,0,null,0]
[null,null,null,null,null,null,null,null,null,null,null,null,null,0,0,0,0,0,0,0,0,0,0,0,0,0,0,null,0,{"$f":"IF(AC52=1,IF(AC$7=$K52,0,1),IF(AD$7=$J52,1,0))","v":0},0,0,0,0,0,0,0,0,0,0,null,{"$f":"$C52*$F52*SUM(Header!$C$13:$C$15)","v":0},{"$f":"IF($G52>15,15,$G52)*$C52*Header!$C$16","v":0},{"$f":"IF($F52>15,15,$F52)*$C52*Header!$C$17","v":0},{"$f":"IF(Header!$C$12=\"Summer\",SUM($AC52:$AG52),IF(Header!$C$12=\"Autumn\",SUM($AC52:$AF52),IF(Header!$C$12=\"Spring\",SUM($AC52:$AE52),0)))*$I52","v":0},0,null,{"$f":"$D52*$F52*SUM(Header!$D$13:$D$15)","v":0},{"$f":"IF($G52>15,15,$G52)*$D52*Header!$D$16","v":0},{"$f":"IF($F52>15,15,$F52)*$D52*Header!$D$17","v":0},{"$f":"IF(Header!$C$12=\"Summer\",SUM($AH52:$AK52),IF(Header!$C$12=\"Autumn\",SUM($AG52:$AI52),IF(Header!$C$12=\"Spring\",SUM($AF52:$AJ52),0)))*$I52","v":0},0,null,{"$f":"$E52*$F52*SUM(Header!$E$13:$E$15)","v":0},{"$f":"IF($G52>15,15,$G52)*$E52*Header!$E$16","v":0},{"$f":"IF($F52>15,15,$F52)*$E52*Header!$E$17","v":0},{"$f":"IF(Header!$C$12=\"Summer\",SUM($AL52:$AN52),IF(Header!$C$12=\"Autumn\",SUM($AJ52:$AN52),IF(Header!$C$12=\"Spring\",SUM($AK52:$AN52),0)))*$I52","v":0},0,null,0,null,0]
[null,null,null,null,null,null,null,null,null,null,null,null,null,0,0,0,0,0,0,0,0,0,0,0,0,0,0,null,0,{"$f":"IF(AC53=1,IF(AC$7=$K53,0,1),IF(AD$7=$J53,1,0))","v":0},0,0,0,0,0,0,0,0,0,0,null,{"$f":"$C53*$F53*SUM(Header!$C$13:$C$15)","v":0},{"$f":"IF($G53>15,15,$G53)*$C53*Header!$C$16","v":0},{"$f":"IF($F53>15,15,$F53)*$C53*Header!$C$17","v":0},{"$f":"IF(Header!$C$12=\"Summer\",SUM($AC53:$AG53),IF(Header!$C$12=\"Autumn\",SUM($AC53:$AF53),IF(Header!$C$12=\"Spring\",SUM($AC53:$AE53),0)))*$I53","v":0},0,null,{"$f":"$D53*$F53*SUM(Header!$D$13:$D$15)","v":0},{"$f":"IF($G53>15,15,$G53)*$D53*Header!$D$16","v":0},{"$f":"IF($F53>15,15,$F53)*$D53*Header!$D$17","v":0},{"$f":"IF(Header!$C$12=\"Summer\",SUM($AH53:$AK53),IF(Header!$C$12=\"Autumn\",SUM($AG53:$AI53),IF(Header!$C$12=\"Spring\",SUM($AF53:$AJ53),0)))*$I53","v":0},0,null,{"$f":"$E53*$F53*SUM(Header!$E$13:$E$15)","v":0},{"$f":"IF($G53>15,15,$G53)*$E53*Header!$E$16","v":0},{"$f":"IF($F53>15,15,$F53)*$E53*Header!$E$17","v":0},{"$f":"IF(Header!$C$12=\"Summer\",SUM($AL53:$AN53),IF(Header!$C$12=\"Autumn\",SUM($AJ53:$AN53),IF(Header!$C$12=\"Spring\",SUM($AK53:$AN53),0)))*$I53","v":0},0,null,0,null,0]
[null,null,null,null,null,null,null,null,null,null,null,null,null,0,0,0,0,0,0,0,0,0,0,0,0,0,0,null,0,{"$f":"IF(AC54=1,IF(AC$7=$K54,0,1),IF(AD$7=$J54,1,0))","v":0},0,0,0,0,0,0,0,0,0,0,null,{"$f":"$C54*$F54*SUM(Header!$C$13:$C$15)","v":0},{"$f":"IF($G54>15,15,$G54)*$C54*Header!$C$16","v":0},{"$f":"IF($F54>15,15,$F54)*$C54*Header!$C$17","v":0},{"$f":"IF(Header!$C$12=\"Summer\",SUM($AC54:$AG54),IF(Header!$C$12=\"Autumn\",SUM($AC54:$AF54),IF(Header!$C$12=\"Spring\",SUM($AC54:$AE54),0)))*$I54","v":0},0,null,{"$f":"$D54*$F54*SUM(Header!$D$13:$D$15)","v":0},{"$f":"IF($G54>15,15,$G54)*$D54*Header!$D$16","v":0},{"$f":"IF($F54>15,15,$F54)*$D54*Header!$D$17","v":0},{"$f":"IF(Header!$C$12=\"Summer\",SUM($AH54:$AK54),IF(Header!$C$12=\"Autumn\",SUM($AG54:$AI54),IF(Header!$C$12=\"Spring\",SUM($AF54:$AJ54),0)))*$I54","v":0},0,null,{"$f":"$E54*$F54*SUM(Header!$E$13:$E$15)","v":0},{"$f":"IF($G54>15,15,$G54)*$E54*Header!$E$16","v":0},{"$f":"IF($F54>15,15,$F54)*$E54*Header!$E$17","v":0},{"$f":"IF(Header!$C$12=\"Summer\",SUM($AL54:$AN54),IF(Header!$C$12=\"Autumn\",SUM($AJ54:$AN54),IF(Header!$C$12=\"Spring\",SUM($AK54:$AN54),0)))*$I54","v":0},0,null,0,null,0]
[null,null,null,null,null,null,null,null,null,null,null,null,null,0,0,0,0,0,0,0,0,0,0,0,0,0,0,null,0,{"$f":"IF(AC55=1,IF(AC$7=$K55,0,1),IF(AD$7=$J55,1,0))","v":0},0,0,0,0,0,0,0,0,0,0,null,{"$f":"$C55*$F55*SUM(Header!$C$13:$C$15)","v":0},{"$f":"IF($G55>15,15,$G55)*$C55*Header!$C$16","v":0},{"$f":"IF($F55>15,15,$F55)*$C55*Header!$C$17","v":0},{"$f":"IF(Header!$C$12=\"Summer\",SUM($AC55:$AG55),IF(Header!$C$12=\"Autumn\",SUM($AC55:$AF55),IF(Header!$C$12=\"Spring\",SUM($AC55:$AE55),0)))*$I55","v":0},0,null,{"$f":"$D55*$F55*SUM(Header!$D$13:$D$15)","v":0},{"$f":"IF($G55>15,15,$G55)*$D55*Header!$D$16","v":0},{"$f":"IF($F55>15,15,$F55)*$D55*Header!$D$17","v":0},{"$f":"IF(Header!$C$12=\"Summer\",SUM($AH55:$AK55),IF(Header!$C$12=\"Autumn\",SUM($AG55:$AI55),IF(Header!$C$12=\"Spring\",SUM($AF55:$AJ55),0)))*$I55","v":0},0,null,{"$f":"$E55*$F55*SUM(Header!$E$13:$E$15)","v":0},{"$f":"IF($G55>15,15,$G55)*$E55*Header!$E$16","v":0},{"$f":"IF($F55>15,15,$F55)*$E55*Header!$E$17","v":0},{"$f":"IF(Header!$C$12=\"Summer\",SUM($AL55:$AN55),IF(Header!$C$12=\"Autumn\",SUM($AJ55:$AN55),IF(Header!$C$12=\"Spring\",SUM($AK55:$AN55),0)))*$I55","v":0},0,null,0,null,0]
[null,null,null,null,null,null,null,null,null,null,null,null,null,0,0,0,0,0,0,0,0,0,0,0,0,0,0,null,0,{"$f":"IF(AC56=1,IF(AC$7=$K56,0,1),IF(AD$7=$J56,1,0))","v":0},0,0,0,0,0,0,0,0,0,0,null,{"$f":"$C56*$F56*SUM(Header!$C$13:$C$15)","v":0},{"$f":"IF($G56>15,15,$G56)*$C56*Header!$C$16","v":0},{"$f":"IF($F56>15,15,$F56)*$C56*Header!$C$17","v":0},{"$f":"IF(Header!$C$12=\"Summer\",SUM($AC56:$AG56),IF(Header!$C$12=\"Autumn\",SUM($AC56:$AF56),IF(Header!$C$12=\"Spring\",SUM($AC56:$AE56),0)))*$I56","v":0},0,null,{"$f":"$D56*$F56*SUM(Header!$D$13:$D$15)","v":0},{"$f":"IF($G56>15,15,$G56)*$D56*Header!$D$16","v":0},{"$f":"IF($F56>15,15,$F56)*$D56*Header!$D$17","v":0},{"$f":"IF(Header!$C$12=\"Summer\",SUM($AH56:$AK56),IF(Header!$C$12=\"Autumn\",SUM($AG56:$AI56),IF(Header!$C$12=\"Spring\",SUM($AF56:$AJ56),0)))*$I56","v":0},0,null,{"$f":"$E56*$F56*SUM(Header!$E$13:$E$15)","v":0},{"$f":"IF($G56>15,15,$G56)*$E56*Header!$E$16","v":0},{"$f":"IF($F56>15,15,$F56)*$E56*Header!$E$17","v":0},{"$f":"IF(Header!$C$12=\"Summer\",SUM($AL56:$AN56),IF(Header!$C$12=\"Autumn\",SUM($AJ56:$AN56),IF(Header!$C$12=\"Spring\",SUM($AK56:$AN56),0)))*$I56","v":0},0,null,0,null,0]
[null,null,null,null,null,null,null,null,null,null,null,null,null,0,0,0,0,0,0,0,0,0,0,0,0,0,0,null,0,{"$f":"IF(AC57=1,IF(AC$7=$K57,0,1),IF(AD$7=$J57,1,0))","v":0},0,0,0,0,0,0,0,0,0,0,null,{"$f":"$C57*$F57*SUM(Header!$C$13:$C$15)","v":0},{"$f":"IF($G57>15,15,$G57)*$C57*Header!$C$16","v":0},{"$f":"IF($F57>15,15,$F57)*$C57*Header!$C$17","v":0},{"$f":"IF(Header!$C$12=\"Summer\",SUM($AC57:$AG57),IF(Header!$C$12=\"Autumn\",SUM($AC57:$AF57),IF(Header!$C$12=\"Spring\",SUM($AC57:$AE57),0)))*$I57","v":0},0,null,{"$f":"$D57*$F57*SUM(Header!$D$13:$D$15)","v":0},{"$f":"IF($G57>15,15,$G57)*$D57*Header!$D$16","v":0},{"$f":"IF($F57>15,15,$F57)*$D57*Header!$D$17","v":0},{"$f":"IF(Header!$C$12=\"Summer\",SUM($AH57:$AK57),IF(Header!$C$12=\"Autumn\",SUM($AG57:$AI57),IF(Header!$C$12=\"Spring\",SUM($AF57:$AJ57),0)))*$I57","v":0},0,null,{"$f":"$E57*$F57*SUM(Header!$E$13:$E$15)","v":0},{"$f":"IF($G57>15,15,$G57)*$E57*Header!$E$16","v":0},{"$f":"IF($F57>15,15,$F57)*$E57*Header!$E$17","v":0},{"$f":"IF(Header!$C$12=\"Summer\",SUM($AL57:$AN57),IF(Header!$C$12=\"Autumn\",SUM($AJ57:$AN57),IF(Header!$C$12=\"Spring\",SUM($AK57:$AN57),0)))*$I57","v":0},0,null,0,null,0]
[null,null,null,null,null,null,null,null,null,null,null,null,null,0,0,0,0,0,0,0,0,0,0,0,0,0,0,null,0,{"$f":"IF(AC58=1,IF(AC$7=$K58,0,1),IF(AD$7=$J58,1,0))","v":0},0,0,0,0,0,0,0,0,0,0,null,{"$f":"$C58*$F58*SUM(Header!$C$13:$C$15)","v":0},{"$f":"IF($G58>15,15,$G58)*$C58*Header!$C$16","v":0},{"$f":"IF($F58>15,15,$F58)*$C58*Header!$C$17","v":0},{"$f":"IF(Header!$C$12=\"Summer\",SUM($AC58:$AG58),IF(Header!$C$12=\"Autumn\",SUM($AC58:$AF58),IF(Header!$C$12=\"Spring\",SUM($AC58:$AE58),0)))*$I58","v":0},0,null,{"$f":"$D58*$F58*SUM(Header!$D$13:$D$15)","v":0},{"$f":"IF($G58>15,15,$G58)*$D58*Header!$D$16","v":0},{"$f":"IF($F58>15,15,$F58)*$D58*Header!$D$17","v":0},{"$f":"IF(Header!$C$12=\"Summer\",SUM($AH58:$AK58),IF(Header!$C$12=\"Autumn\",SUM($AG58:$AI58),IF(Header!$C$12=\"Spring\",SUM($AF58:$AJ58),0)))*$I58","v":0},0,null,{"$f":"$E58*$F58*SUM(Header!$E$13:$E$15)","v":0},{"$f":"IF($G58>15,15,$G58)*$E58*Header!$E$16","v":0},{"$f":"IF($F58>15,15,$F58)*$E58*Header!$E$17","v":0},{"$f":"IF(Header!$C$12=\"Summer\",SUM($AL58:$AN58),IF(Header!$C$12=\"Autumn\",SUM($AJ58:$AN58),IF(Header!$C$12=\"Spring\",SUM($AK58:$AN58),0)))*$I58","v":0},0,null,0,null,0]
[null,null,null,null,null,null,null,null,null,null,null,null,null,0,0,0,0,0,0,0,0,0,0,0,0,0,0,null,0,{"$f":"IF(AC59=1,IF(AC$7=$K59,0,1),IF(AD$7=$J59,1,0))","v":0},0,0,0,0,0,0,0,0,0,0,null,{"$f":"$C59*$F59*SUM(Header!$C$13:$C$15)","v":0},{"$f":"IF($G59>15,15,$G59)*$C59*Header!$C$16","v":0},{"$f":"IF($F59>15,15,$F59)*$C59*Header!$C$17","v":0},{"$f":"IF(Header!$C$12=\"Summer\",SUM($AC59:$AG59),IF(Header!$C$12=\"Autumn\",SUM($AC59:$AF59),IF(Header!$C$12=\"Spring\",SUM($AC59:$AE59),0)))*$I59","v":0},0,null,{"$f":"$D59*$F59*SUM(Header!$D$13:$D$15)","v":0},{"$f":"IF($G59>15,15,$G59)*$D59*Header!$D$16","v":0},{"$f":"IF($F59>15,15,$F59)*$D59*Header!$D$17","v":0},{"$f":"IF(Header!$C$12=\"Summer\",SUM($AH59:$AK59),IF(Header!$C$12=\"Autumn\",SUM($AG59:$AI59),IF(Header!$C$12=\"Spring\",SUM($AF59:$AJ59),0)))*$I59","v":0},0,null,{"$f":"$E59*$F59*SUM(Header!$E$13:$E$15)","v":0},{"$f":"IF($G59>15,15,$G59)*$E59*Header!$E$16","v":0},{"$f":"IF($F59>15,15,$F59)*$E59*Header!$E$17","v":0},{"$f":"IF(Header!$C$12=\"Summer\",SUM($AL59:$AN59),IF(Header!$C$12=\"Autumn\",SUM($AJ59:$AN59),IF(Header!$C$12=\"Spring\",SUM($AK59:$AN59),0)))*$I59","v":0},0,null,0,null,0]
[null,null,null,null,null,null,null,null,null,null,null,null,null,0,0,0,0,0,0,0,0,0,0,0,0,0,0,null,0,{"$f":"IF(AC60=1,IF(AC$7=$K60,0,1),IF(AD$7=$J60,1,0))","v":0},0,0,0,0,0,0,0,0,0,0,null,{"$f":"$C60*$F60*SUM(Header!$C$13:$C$15)","v":0},{"$f":"IF($G60>15,15,$G60)*$C60*Header!$C$16","v":0},{"$f":"IF($F60>15,15,$F60)*$C60*Header!$C$17","v":0},{"$f":"IF(Header!$C$12=\"Summer\",SUM($AC60:$AG60),IF(Header!$C$12=\"Autumn\",SUM($AC60:$AF60),IF(Header!$C$12=\"Spring\",SUM($AC60:$AE60),0)))*$I60","v":0},0,null,{"$f":"$D60*$F60*SUM(Header!$D$13:$D$15)","v":0},{"$f":"IF($G60>15,15,$G60)*$D60*Header!$D$16","v":0},{"$f":"IF($F60>15,15,$F60)*$D60*Header!$D$17","v":0},{"$f":"IF(Header!$C$12=\"Summer\",SUM($AH60:$AK60),IF(Header!$C$12=\"Autumn\",SUM($AG60:$AI60),IF(Header!$C$12=\"Spring\",SUM($AF60:$AJ60),0)))*$I60","v":0},0,null,{"$f":"$E60*$F60*SUM(Header!$E$13:$E$15)","v":0},{"$f":"IF($G60>15,15,$G60)*$E60*Header!$E$16","v":0},{"$f":"IF($F60>15,15,$F60)*$E60*Header!$E$17","v":0},{"$f":"IF(Header!$C$12=\"Summer\",SUM($AL60:$AN60),IF(Header!$C$12=\"Autumn\",SUM($AJ60:$AN60),IF(Header!$C$12=\"Spring\",SUM($AK60:$AN60),0)))*$I60","v":0},0,null,0,null,0]
[null,null,null,null,null,null,null,null,null,null,null,null,null,0,0,0,0,0,0,0,0,0,0,0,0,0,0,null,0,{"$f":"IF(AC61=1,IF(AC$7=$K61,0,1),IF(AD$7=$J61,1,0))","v":0},0,0,0,0,0,0,0,0,0,0,null,{"$f":"$C61*$F61*SUM(Header!$C$13:$C$15)","v":0},{"$f":"IF($G61>15,15,$G61)*$C61*Header!$C$16","v":0},{"$f":"IF($F61>15,15,$F61)*$C61*Header!$C$17","v":0},{"$f":"IF(Header!$C$12=\"Summer\",SUM($AC61:$AG61),IF(Header!$C$12=\"Autumn\",SUM($AC61:$AF61),IF(Header!$C$12=\"Spring\",SUM($AC61:$AE61),0)))*$I61","v":0},0,null,{"$f":"$D61*$F61*SUM(Header!$D$13:$D$15)","v":0},{"$f":"IF($G61>15,15,$G61)*$D61*Header!$D$16","v":0},{"$f":"IF($F61>15,15,$F61)*$D61*Header!$D$17","v":0},{"$f":"IF(Header!$C$12=\"Summer\",SUM($AH61:$AK61),IF(Header!$C$12=\"Autumn\",SUM($AG61:$AI61),IF(Header!$C$12=\"Spring\",SUM($AF61:$AJ61),0)))*$I61","v":0},0,null,{"$f":"$E61*$F61*SUM(Header!$E$13:$E$15)","v":0},{"$f":"IF($G61>15,15,$G61)*$E61*Header!$E$16","v":0},{"$f":"IF($F61>15,15,$F61)*$E61*Header!$E$17","v":0},{"$f":"IF(Header!$C$12=\"Summer\",SUM($AL61:$AN61),IF(Header!$C$12=\"Autumn\",SUM($AJ61:$AN61),IF(Header!$C$12=\"Spring\",SUM($AK61:$AN61),0)))*$I61","v":0},0,null,0,null,0]
[null,null,null,null,null,null,null,null,null,null,null,null,null,0,0,0,0,0,0,0,0,0,0,0,0,0,0,null,0,{"$f":"IF(AC62=1,IF(AC$7=$K62,0,1),IF(AD$7=$J62,1,0))","v":0},0,0,0,0,0,0,0,0,0,0,null,{"$f":"$C62*$F62*SUM(Header!$C$13:$C$15)","v":0},{"$f":"IF($G62>15,15,$G62)*$C62*Header!$C$16","v":0},{"$f":"IF($F62>15,15,$F62)*$C62*Header!$C$17","v":0},{"$f":"IF(Header!$C$12=\"Summer\",SUM($AC62:$AG62),IF(Header!$C$12=\"Autumn\",SUM($AC62:$AF62),IF(Header!$C$12=\"Spring\",SUM($AC62:$AE62),0)))*$I62","v":0},0,null,{"$f":"$D62*$F62*SUM(Header!$D$13:$D$15)","v":0},{"$f":"IF($G62>15,15,$G62)*$D62*Header!$D$16","v":0},{"$f":"IF($F62>15,15,$F62)*$D62*Header!$D$17","v":0},{"$f":"IF(Header!$C$12=\"Summer\",SUM($AH62:$AK62),IF(Header!$C$12=\"Autumn\",SUM($AG62:$AI62),IF(Header!$C$12=\"Spring\",SUM($AF62:$AJ62),0)))*$I62","v":0},0,null,{"$f":"$E62*$F62*SUM(Header!$E$13:$E$15)","v":0},{"$f":"IF($G62>15,15,$G62)*$E62*Header!$E$16","v":0},{"$f":"IF($F62>15,15,$F62)*$E62*Header!$E$17","v":0},{"$f":"IF(Header!$C$12=\"Summer\",SUM($AL62:$AN62),IF(Header!$C$12=\"Autumn\",SUM($AJ62:$AN62),IF(Header!$C$12=\"Spring\",SUM($AK62:$AN62),0)))*$I62","v":0},0,null,0,null,0]
[null,null,null,null,null,null,null,null,null,null,null,null,null,0,0,0,0,0,0,0,0,0,0,0,0,0,0,null,0,{"$f":"IF(AC63=1,IF(AC$7=$K63,0,1),IF(AD$7=$J63,1,0))","v":0},0,0,0,0,0,0,0,0,0,0,null,{"$f":"$C63*$F63*SUM(Header!$C$13:$C$15)","v":0},{"$f":"IF($G63>15,15,$G63)*$C63*Header!$C$16","v":0},{"$f":"IF($F63>15,15,$F63)*$C63*Header!$C$17","v":0},{"$f":"IF(Header!$C$12=\"Summer\",SUM($AC63:$AG63),IF(Header!$C$12=\"Autumn\",SUM($AC63:$AF63),IF(Header!$C$12=\"Spring\",SUM($AC63:$AE63),0)))*$I63","v":0},0,null,{"$f":"$D63*$F63*SUM(Header!$D$13:$D$15)","v":0},{"$f":"IF($G63>15,15,$G63)*$D63*Header!$D$16","v":0},{"$f":"IF($F63>15,15,$F63)*$D63*Header!$D$17","v":0},{"$f":"IF(Header!$C$12=\"Summer\",SUM($AH63:$AK63),IF(Header!$C$12=\"Autumn\",SUM($AG63:$AI63),IF(Header!$C$12=\"Spring\",SUM($AF63:$AJ63),0)))*$I63","v":0},0,null,{"$f":"$E63*$F63*SUM(Header!$E$13:$E$15)","v":0},{"$f":"IF($G63>15,15,$G63)*$E63*Header!$E$16","v":0},{"$f":"IF($F63>15,15,$F63)*$E63*Header!$E$17","v":0},{"$f":"IF(Header!$C$12=\"Summer\",SUM($AL63:$AN63),IF(Header!$C$12=\"Autumn\",SUM($AJ63:$AN63),IF(Header!$C$12=\"Spring\",SUM($AK63:$AN63),0)))*$I63","v":0},0,null,0,null,0]
[null,null,null,null,null,null,null,null,null,null,null,null,null,0,0,0,0,0,0,0,0,0,0,0,0,0,0,null,0,{"$f":"IF(AC64=1,IF(AC$7=$K64,0,1),IF(AD$7=$J64,1,0))","v":0},0,0,0,0,0,0,0,0,0,0,null,{"$f":"$C64*$F64*SUM(Header!$C$13:$C$15)","v":0},{"$f":"IF($G64>15,15,$G64)*$C64*Header!$C$16","v":0},{"$f":"IF($F64>15,15,$F64)*$C64*Header!$C$17","v":0},{"$f":"IF(Header!$C$12=\"Summer\",SUM($AC64:$AG64),IF(Header!$C$12=\"Autumn\",SUM($AC64:$AF64),IF(Header!$C$12=\"Spring\",SUM($AC64:$AE64),0)))*$I64","v":0},0,null,{"$f":"$D64*$F64*SUM(Header!$D$13:$D$15)","v":0},{"$f":"IF($G64>15,15,$G64)*$D64*Header!$D$16","v":0},{"$f":"IF($F64>15,15,$F64)*$D64*Header!$D$17","v":0},{"$f":"IF(Header!$C$12=\"Summer\",SUM($AH64:$AK64),IF(Header!$C$12=\"Autumn\",SUM($AG64:$AI64),IF(Header!$C$12=\"Spring\",SUM($AF64:$AJ64),0)))*$I64","v":0},0,null,{"$f":"$E64*$F64*SUM(Header!$E$13:$E$15)","v":0},{"$f":"IF($G64>15,15,$G64)*$E64*Header!$E$16","v":0},{"$f":"IF($F64>15,15,$F64)*$E64*Header!$E$17","v":0},{"$f":"IF(Header!$C$12=\"Summer\",SUM($AL64:$AN64),IF(Header!$C$12=\"Autumn\",SUM($AJ64:$AN64),IF(Header!$C$12=\"Spring\",SUM($AK64:$AN64),0)))*$I64","v":0},0,null,0,null,0]
[null,null,null,null,null,null,null,null,null,null,null,null,null,0,0,0,0,0,0,0,0,0,0,0,0,0,0,null,0,{"$f":"IF(AC65=1,IF(AC$7=$K65,0,1),IF(AD$7=$J65,1,0))","v":0},0,0,0,0,0,0,0,0,0,0,null,{"$f":"$C65*$F65*SUM(Header!$C$13:$C$15)","v":0},{"$f":"IF($G65>15,15,$G65)*$C65*Header!$C$16","v":0},{"$f":"IF($F65>15,15,$F65)*$C65*Header!$C$17","v":0},{"$f":"IF(Header!$C$12=\"Summer\",SUM($AC65:$AG65),IF(Header!$C$12=\"Autumn\",SUM($AC65:$AF65),IF(Header!$C$12=\"Spring\",SUM($AC65:$AE65),0)))*$I65","v":0},0,null,{"$f":"$D65*$F65*SUM(Header!$D$13:$D$15)","v":0},{"$f":"IF($G65>15,15,$G65)*$D65*Header!$D$16","v":0},{"$f":"IF($F65>15,15,$F65)*$D65*Header!$D$17","v":0},{"$f":"IF(Header!$C$12=\"Summer\",SUM($AH65:$AK65),IF(Header!$C$12=\"Autumn\",SUM($AG65:$AI65),IF(Header!$C$12=\"Spring\",SUM($AF65:$AJ65),0)))*$I65","v":0},0,null,{"$f":"$E65*$F65*SUM(Header!$E$13:$E$15)","v":0},{"$f":"IF($G65>15,15,$G65)*$E65*Header!$E$16","v":0},{"$f":"IF($F65>15,15,$F65)*$E65*Header!$E$17","v":0},{"$f":"IF(Header!$C$12=\"Summer\",SUM($AL65:$AN65),IF(Header!$C$12=\"Autumn\",SUM($AJ65:$AN65),IF(Header!$C$12=\"Spring\",SUM($AK65:$AN65),0)))*$I65","v":0},0,null,0,null,0]
[null,null,null,null,null,null,null,null,null,null,null,null,null,0,0,0,0,0,0,0,0,0,0,0,0,0,0,null,0,{"$f":"IF(AC66=1,IF(AC$7=$K66,0,1),IF(AD$7=$J66,1,0))","v":0},0,0,0,0,0,0,0,0,0,0,null,{"$f":"$C66*$F66*SUM(Header!$C$13:$C$15)","v":0},{"$f":"IF($G66>15,15,$G66)*$C66*Header!$C$16","v":0},{"$f":"IF($F66>15,15,$F66)*$C66*Header!$C$17","v":0},{"$f":"IF(Header!$C$12=\"Summer\",SUM($AC66:$AG66),IF(Header!$C$12=\"Autumn\",SUM($AC66:$AF66),IF(Header!$C$12=\"Spring\",SUM($AC66:$AE66),0)))*$I66","v":0},0,null,{"$f":"$D66*$F66*SUM(Header!$D$13:$D$15)","v":0},{"$f":"IF($G66>15,15,$G66)*$D66*Header!$D$16","v":0},{"$f":"IF($F66>15,15,$F66)*$D66*Header!$D$17","v":0},{"$f":"IF(Header!$C$12=\"Summer\",SUM($AH66:$AK66),IF(Header!$C$12=\"Autumn\",SUM($AG66:$AI66),IF(Header!$C$12=\"Spring\",SUM($AF66:$AJ66),0)))*$I66","v":0},0,null,{"$f":"$E66*$F66*SUM(Header!$E$13:$E$15)","v":0},{"$f":"IF($G66>15,15,$G66)*$E66*Header!$E$16","v":0},{"$f":"IF($F66>15,15,$F66)*$E66*Header!$E$17","v":0},{"$f":"IF(Header!$C$12=\"Summer\",SUM($AL66:$AN66),IF(Header!$C$12=\"Autumn\",SUM($AJ66:$AN66),IF(Header!$C$12=\"Spring\",SUM($AK66:$AN66),0)))*$I66","v":0},0,null,0,null,0]
[null,null,null,null,null,null,null,null,null,null,null,null,null,0,0,0,0,0,0,0,0,0,0,0,0,0,0,null,0,{"$f":"IF(AC67=1,IF(AC$7=$K67,0,1),IF(AD$7=$J67,1,0))","v":0},0,0,0,0,0,0,0,0,0,0,null,{"$f":"$C67*$F67*SUM(Header!$C$13:$C$15)","v":0},{"$f":"IF($G67>15,15,$G67)*$C67*Header!$C$16","v":0},{"$f":"IF($F67>15,15,$F67)*$C67*Header!$C$17","v":0},{"$f":"IF(Header!$C$12=\"Summer\",SUM($AC67:$AG67),IF(Header!$C$12=\"Autumn\",SUM($AC67:$AF67),IF(Header!$C$12=\"Spring\",SUM($AC67:$AE67),0)))*$I67","v":0},0,null,{"$f":"$D67*$F67*SUM(Header!$D$13:$D$15)","v":0},{"$f":"IF($G67>15,15,$G67)*$D67*Header!$D$16","v":0},{"$f":"IF($F67>15,15,$F67)*$D67*Header!$D$17","v":0},{"$f":"IF(Header!$C$12=\"Summer\",SUM($AH67:$AK67),IF(Header!$C$12=\"Autumn\",SUM($AG67:$AI67),IF(Header!$C$12=\"Spring\",SUM($AF67:$AJ67),0)))*$I67","v":0},0,null,{"$f":"$E67*$F67*SUM(Header!$E$13:$E$15)","v":0},{"$f":"IF($G67>15,15,$G67)*$E67*Header!$E$16","v":0},{"$f":"IF($F67>15,15,$F67)*$E67*Header!$E$17","v":0},{"$f":"IF(Header!$C$12=\"Summer\",SUM($AL67:$AN67),IF(Header!$C$12=\"Autumn\",SUM($AJ67:$AN67),IF(Header!$C$12=\"Spring\",SUM($AK67:$AN67),0)))*$I67","v":0},0,null,0,null,0]
[null,null,null,null,null,null,null,null,null,null,null,null,null,0,0,0,0,0,0,0,0,0,0,0,0,0,0,null,0,{"$f":"IF(AC68=1,IF(AC$7=$K68,0,1),IF(AD$7=$J68,1,0))","v":0},0,0,0,0,0,0,0,0,0,0,null,{"$f":"$C68*$F68*SUM(Header!$C$13:$C$15)","v":0},{"$f":"IF($G68>15,15,$G68)*$C68*Header!$C$16","v":0},{"$f":"IF($F68>15,15,$F68)*$C68*Header!$C$17","v":0},{"$f":"IF(Header!$C$12=\"Summer\",SUM($AC68:$AG68),IF(Header!$C$12=\"Autumn\",SUM($AC68:$AF68),IF(Header!$C$12=\"Spring\",SUM($AC68:$AE68),0)))*$I68","v":0},0,null,{"$f":"$D68*$F68*SUM(Header!$D$13:$D$15)","v":0},{"$f":"IF($G68>15,15,$G68)*$D68*Header!$D$16","v":0},{"$f":"IF($F68>15,15,$F68)*$D68*Header!$D$17","v":0},{"$f":"IF(Header!$C$12=\"Summer\",SUM($AH68:$AK68),IF(Header!$C$12=\"Autumn\",SUM($AG68:$AI68),IF(Header!$C$12=\"Spring\",SUM($AF68:$AJ68),0)))*$I68","v":0},0,null,{"$f":"$E68*$F68*SUM(Header!$E$13:$E$15)","v":0},{"$f":"IF($G68>15,15,$G68)*$E68*Header!$E$16","v":0},{"$f":"IF($F68>15,15,$F68)*$E68*Header!$E$17","v":0},{"$f":"IF(Header!$C$12=\"Summer\",SUM($AL68:$AN68),IF(Header!$C$12=\"Autumn\",SUM($AJ68:$AN68),IF(Header!$C$12=\"Spring\",SUM($AK68:$AN68),0)))*$I68","v":0},0,null,0,null,0]
[null,null,null,null,null,null,null,null,null,null,null,null,null,0,0,0,0,0,0,0,0,0,0,0,0,0,0,null,0,{"$f":"IF(AC69=1,IF(AC$7=$K69,0,1),IF(AD$7=$J69,1,0))","v":0},0,0,0,0,0,0,0,0,0,0,null,{"$f":"$C69*$F69*SUM(Header!$C$13:$C$15)","v":0},{"$f":"IF($G69>15,15,$G69)*$C69*Header!$C$16","v":0},{"$f":"IF($F69>15,15,$F69)*$C69*Header!$C$17","v":0},{"$f":"IF(Header!$C$12=\"Summer\",SUM($AC69:$AG69),IF(Header!$C$12=\"Autumn\",SUM($AC69:$AF69),IF(Header!$C$12=\"Spring\",SUM($AC69:$AE69),0)))*$I69","v":0},0,null,{"$f":"$D69*$F69*SUM(Header!$D$13:$D$15)","v":0},{"$f":"IF($G69>15,15,$G69)*$D69*Header!$D$16","v":0},{"$f":"IF($F69>15,15,$F69)*$D69*Header!$D$17","v":0},{"$f":"IF(Header!$C$12=\"Summer\",SUM($AH69:$AK69),IF(Header!$C$12=\"Autumn\",SUM($AG69:$AI69),IF(Header!$C$12=\"Spring\",SUM($AF69:$AJ69),0)))*$I69","v":0},0,null,{"$f":"$E69*$F69*SUM(Header!$E$13:$E$15)","v":0},{"$f":"IF($G69>15,15,$G69)*$E69*Header!$E$16","v":0},{"$f":"IF($F69>15,15,$F69)*$E69*Header!$E$17","v":0},{"$f":"IF(Header!$C$12=\"Summer\",SUM($AL69:$AN69),IF(Header!$C$12=\"Autumn\",SUM($AJ69:$AN69),IF(Header!$C$12=\"Spring\",SUM($AK69:$AN69),0)))*$I69","v":0},0,null,0,null,0]
[null,null,null,null,null,null,null,null,null,null,null,null,null,0,0,0,0,0,0,0,0,0,0,0,0,0,0,null,0,{"$f":"IF(AC70=1,IF(AC$7=$K70,0,1),IF(AD$7=$J70,1,0))","v":0},0,0,0,0,0,0,0,0,0,0,null,{"$f":"$C70*$F70*SUM(Header!$C$13:$C$15)","v":0},{"$f":"IF($G70>15,15,$G70)*$C70*Header!$C$16","v":0},{"$f":"IF($F70>15,15,$F70)*$C70*Header!$C$17","v":0},{"$f":"IF(Header!$C$12=\"Summer\",SUM($AC70:$AG70),IF(Header!$C$12=\"Autumn\",SUM($AC70:$AF70),IF(Header!$C$12=\"Spring\",SUM($AC70:$AE70),0)))*$I70","v":0},0,null,{"$f":"$D70*$F70*SUM(Header!$D$13:$D$15)","v":0},{"$f":"IF($G70>15,15,$G70)*$D70*Header!$D$16","v":0},{"$f":"IF($F70>15,15,$F70)*$D70*Header!$D$17","v":0},{"$f":"IF(Header!$C$12=\"Summer\",SUM($AH70:$AK70),IF(Header!$C$12=\"Autumn\",SUM($AG70:$AI70),IF(Header!$C$12=\"Spring\",SUM($AF70:$AJ70),0)))*$I70","v":0},0,null,{"$f":"$E70*$F70*SUM(Header!$E$13:$E$15)","v":0},{"$f":"IF($G70>15,15,$G70)*$E70*Header!$E$16","v":0},{"$f":"IF($F70>15,15,$F70)*$E70*Header!$E$17","v":0},{"$f":"IF(Header!$C$12=\"Summer\",SUM($AL70:$AN70),IF(Header!$C$12=\"Autumn\",SUM($AJ70:$AN70),IF(Header!$C$12=\"Spring\",SUM($AK70:$AN70),0)))*$I70","v":0},0,null,0,null,0]
[null,null,null,null,null,null,null,null,null,null,null,null,null,0,0,0,0,0,0,0,0,0,0,0,0,0,0,null,0,{"$f":"IF(AC71=1,IF(AC$7=$K71,0,1),IF(AD$7=$J71,1,0))","v":0},0,0,0,0,0,0,0,0,0,0,null,{"$f":"$C71*$F71*SUM(Header!$C$13:$C$15)","v":0},{"$f":"IF($G71>15,15,$G71)*$C71*Header!$C$16","v":0},{"$f":"IF($F71>15,15,$F71)*$C71*Header!$C$17","v":0},{"$f":"IF(Header!$C$12=\"Summer\",SUM($AC71:$AG71),IF(Header!$C$12=\"Autumn\",SUM($AC71:$AF71),IF(Header!$C$12=\"Spring\",SUM($AC71:$AE71),0)))*$I71","v":0},0,null,{"$f":"$D71*$F71*SUM(Header!$D$13:$D$15)","v":0},{"$f":"IF($G71>15,15,$G71)*$D71*Header!$D$16","v":0},{"$f":"IF($F71>15,15,$F71)*$D71*Header!$D$17","v":0},{"$f":"IF(Header!$C$12=\"Summer\",SUM($AH71:$AK71),IF(Header!$C$12=\"Autumn\",SUM($AG71:$AI71),IF(Header!$C$12=\"Spring\",SUM($AF71:$AJ71),0)))*$I71","v":0},0,null,{"$f":"$E71*$F71*SUM(Header!$E$13:$E$15)","v":0},{"$f":"IF($G71>15,15,$G71)*$E71*Header!$E$16","v":0},{"$f":"IF($F71>15,15,$F71)*$E71*Header!$E$17","v":0},{"$f":"IF(Header!$C$12=\"Summer\",SUM($AL71:$AN71),IF(Header!$C$12=\"Autumn\",SUM($AJ71:$AN71),IF(Header!$C$12=\"Spring\",SUM($AK71:$AN71),0)))*$I71","v":0},0,null,0,null,0]
[null,null,null,null,null,null,null,null,null,null,null,null,null,0,0,0,0,0,0,0,0,0,0,0,0,0,0,null,0,{"$f":"IF(AC72=1,IF(AC$7=$K72,0,1),IF(AD$7=$J72,1,0))","v":0},0,0,0,0,0,0,0,0,0,0,null,{"$f":"$C72*$F72*SUM(Header!$C$13:$C$15)","v":0},{"$f":"IF($G72>15,15,$G72)*$C72*Header!$C$16","v":0},{"$f":"IF($F72>15,15,$F72)*$C72*Header!$C$17","v":0},{"$f":"IF(Header!$C$12=\"Summer\",SUM($AC72:$AG72),IF(Header!$C$12=\"Autumn\",SUM($AC72:$AF72),IF(Header!$C$12=\"Spring\",SUM($AC72:$AE72),0)))*$I72","v":0},0,null,{"$f":"$D72*$F72*SUM(Header!$D$13:$D$15)","v":0},{"$f":"IF($G72>15,15,$G72)*$D72*Header!$D$16","v":0},{"$f":"IF($F72>15,15,$F72)*$D72*Header!$D$17","v":0},{"$f":"IF(Header!$C$12=\"Summer\",SUM($AH72:$AK72),IF(Header!$C$12=\"Autumn\",SUM($AG72:$AI72),IF(Header!$C$12=\"Spring\",SUM($AF72:$AJ72),0)))*$I72","v":0},0,null,{"$f":"$E72*$F72*SUM(Header!$E$13:$E$15)","v":0},{"$f":"IF($G72>15,15,$G72)*$E72*Header!$E$16","v":0},{"$f":"IF($F72>15,15,$F72)*$E72*Header!$E$17","v":0},{"$f":"IF(Header!$C$12=\"Summer\",SUM($AL72:$AN72),IF(Header!$C$12=\"Autumn\",SUM($AJ72:$AN72),IF(Header!$C$12=\"Spring\",SUM($AK72:$AN72),0)))*$I72","v":0},0,null,0,null,0]
[null,null,null,null,null,null,null,null,null,null,null,null,null,{"$f":"IF(N$7=\"April\",SUM($AP73:$AR73)/5,IF(N$7=\"September\",SUM($AP73:$AR73)/4,SUM($AP73:$AR73)/3))+(AC73*$I73)","v":0},{"$f":"IF(O$7=\"May\",SUM($AP73:$AR73)/5,IF(O$7=\"October\",SUM($AP73:$AR73)/4,SUM($AP73:$AR73)/3))+(AD73*$I73)","v":0},{"$f":"IF(P$7=\"June\",SUM($AP73:$AR73)/5,IF(P$7=\"November\",SUM($AP73:$AR73)/4,SUM($AP73:$AR73)/3))+(AE73*$I73)","v":0},{"$f":"IF(Q$7=\"July\",SUM($AP73:$AR73)/5,IF(Q$7=\"December\",SUM($AP73:$AR73)/4,SUM($AV73:$AX73)/5))+(AF73*$I73)","v":0},{"$f":"IF(R$7=\"August\",SUM($AP73:$AR73)/5,IF(R$7=\"January\",SUM($AV73:$AX73)/3,SUM($AV73:$AX73)/5))+(AG73*$I73)","v":0},{"$f":"IF(S$7=\"September\",SUM($AV73:$AX73)/4,IF(S$7=\"February\",SUM($AV73:$AX73)/3,SUM($AV73:$AX73)/5))+(AH73*$I73)","v":0},{"$f":"IF(T$7=\"October\",SUM($AV73:$AX73)/4,IF(T$7=\"March\",SUM($AV73:$AX73)/3,SUM($AV73:$AX73)/5))+(AI73*$I73)","v":0},{"$f":"IF(U$7=\"November\",SUM($AV73:$AX73)/4,IF(U$7=\"April\",SUM($BB73:$BD73)/5,SUM($AV73:$AX73)/5))+(AJ73*$I73)","v":0},{"$f":"IF(V$7=\"December\",SUM($AV73:$AX73)/4,IF(V$7=\"May\",SUM($BB73:$BD73)/5,SUM($BB73:$BD73)/4))+(AK73*$I73)","v":0},{"$f":"IF(W$7=\"January\",SUM($BB73:$BD73)/3,IF(W$7=\"June\",SUM($BB73:$BD73)/5,SUM($BB73:$BD73)/4))+(AL73*$I73)","v":0},{"$f":"IF(X$7=\"February\",SUM($BB73:$BD73)/3,IF(X$7=\"July\",SUM($BB73:$BD73)/5,SUM($BB73:$BD73)/4))+(AM73*$I73)","v":0},{"$f":"IF(Y$7=\"March\",SUM($BB73:$BD73)/3,IF(Y$7=\"August\",SUM($BB73:$BD73)/5,SUM($BB73:$BD73)/4))+(AN73*$I73)","v":0},{"$f":"BH73","v":0},{"$f":"SUM(N73:Z73)","v":0},null,{"$f":"IF(AC$7=$J73,1,0)","v":0},{"$f":"IF(AC73=1,IF(AC$7=$K73,0,1),IF(AD$7=$J73,1,0))","v":0},0,0,0,0,0,0,0,0,0,0,null,{"$f":"$C73*$F73*SUM(Header!$C$13:$C$15)","v":0},{"$f":"IF($G73>15,15,$G73)*$C73*Header!$C$16","v":0},{"$f":"IF($F73>15,15,$F73)*$C73*Header!$C$17","v":0},{"$f":"IF(Header!$C$12=\"Summer\",SUM($AC73:$AG73),IF(Header!$C$12=\"Autumn\",SUM($AC73:$AF73),IF(Header!$C$12=\"Spring\",SUM($AC73:$AE73),0)))*$I73","v":0},{"$f":"SUM(AP73:AS73)","v":0},null,{"$f":"$D73*$F73*SUM(Header!$D$13:$D$15)","v":0},{"$f":"IF($G73>15,15,$G73)*$D73*Header!$D$16","v":0},{"$f":"IF($F73>15,15,$F73)*$D73*Header!$D$17","v":0},{"$f":"IF(Header!$C$12=\"Summer\",SUM($AH73:$AK73),IF(Header!$C$12=\"Autumn\",SUM($AG73:$AI73),IF(Header!$C$12=\"Spring\",SUM($AF73:$AJ73),0)))*$I73","v":0},{"$f":"SUM(AV73:AY73)","v":0},null,{"$f":"$E73*$F73*SUM(Header!$E$13:$E$15)","v":0},{"$f":"IF($G73>15,15,$G73)*$E73*Header!$E$16","v":0},{"$f":"IF($F73>15,15,$F73)*$E73*Header!$E$17","v":0},{"$f":"IF(Header!$C$12=\"Summer\",SUM($AL73:$AN73),IF(Header!$C$12=\"Autumn\",SUM($AJ73:$AN73),IF(Header!$C$12=\"Spring\",SUM($AK73:$AN73),0)))*$I73","v":0},{"$f":"SUM(BB73:BE73)","v":0},null,{"$f":"IF(L73=\"YES\",615,0)","v":0},null,{"$f":"AT73+AZ73+BF73+BH73","v":0}]
[null,null,null,null,null,null,null,null,null,null,null,null,null,0,0,0,0,0,0,0,0,0,0,0,0,0,0,null,0,{"$f":"IF(AC74=1,IF(AC$7=$K74,0,1),IF(AD$7=$J74,1,0))","v":0},0,0,0,0,0,0,0,0,0,0,null,{"$f":"$C74*$F74*SUM(Header!$C$13:$C$15)","v":0},{"$f":"IF($G74>15,15,$G74)*$C74*Header!$C$16","v":0},{"$f":"IF($F74>15,15,$F74)*$C74*Header!$C$17","v":0},{"$f":"IF(Header!$C$12=\"Summer\",SUM($AC74:$AG74),IF(Header!$C$12=\"Autumn\",SUM($AC74:$AF74),IF(Header!$C$12=\"Spring\",SUM($AC74:$AE74),0)))*$I74","v":0},0,null,{"$f":"$D74*$F74*SUM(Header!$D$13:$D$15)","v":0},{"$f":"IF($G74>15,15,$G74)*$D74*Header!$D$16","v":0},{"$f":"IF($F74>15,15,$F74)*$D74*Header!$D$17","v":0},{"$f":"IF(Header!$C$12=\"Summer\",SUM($AH74:$AK74),IF(Header!$C$12=\"Autumn\",SUM($AG74:$AI74),IF(Header!$C$12=\"Spring\",SUM($AF74:$AJ74),0)))*$I74","v":0},0,null,{"$f":"$E74*$F74*SUM(Header!$E$13:$E$15)","v":0},{"$f":"IF($G74>15,15,$G74)*$E74*Header!$E$16","v":0},{"$f":"IF($F74>15,15,$F74)*$E74*Header!$E$17","v":0},{"$f":"IF(Header!$C$12=\"Summer\",SUM($AL74:$AN74),IF(Header!$C$12=\"Autumn\",SUM($AJ74:$AN74),IF(Header!$C$12=\"Spring\",SUM($AK74:$AN74),0)))*$I74","v":0},0,null,0,null,0]
[null,null,null,null,null,null,null,null,null,null,null,null,null,0,0,0,0,0,0,0,0,0,0,0,0,0,0,null,0,{"$f":"IF(AC75=1,IF(AC$7=$K75,0,1),IF(AD$7=$J75,1,0))","v":0},0,0,0,0,0,0,0,0,0,0,null,{"$f":"$C75*$F75*SUM(Header!$C$13:$C$15)","v":0},{"$f":"IF($G75>15,15,$G75)*$C75*Header!$C$16","v":0},{"$f":"IF($F75>15,15,$F75)*$C75*Header!$C$17","v":0},{"$f":"IF(Header!$C$12=\"Summer\",SUM($AC75:$AG75),IF(Header!$C$12=\"Autumn\",SUM($AC75:$AF75),IF(Header!$C$12=\"Spring\",SUM($AC75:$AE75),0)))*$I75","v":0},0,null,{"$f":"$D75*$F75*SUM(Header!$D$13:$D$15)","v":0},{"$f":"IF($G75>15,15,$G75)*$D75*Header!$D$16","v":0},{"$f":"IF($F75>15,15,$F75)*$D75*Header!$D$17","v":0},{"$f":"IF(Header!$C$12=\"Summer\",SUM($AH75:$AK75),IF(Header!$C$12=\"Autumn\",SUM($AG75:$AI75),IF(Header!$C$12=\"Spring\",SUM($AF75:$AJ75),0)))*$I75","v":0},0,null,{"$f":"$E75*$F75*SUM(Header!$E$13:$E$15)","v":0},{"$f":"IF($G75>15,15,$G75)*$E75*Header!$E$16","v":0},{"$f":"IF($F75>15,15,$F75)*$E75*Header!$E$17","v":0},{"$f":"IF(Header!$C$12=\"Summer\",SUM($AL75:$AN75),IF(Header!$C$12=\"Autumn\",SUM($AJ75:$AN75),IF(Header!$C$12=\"Spring\",SUM($AK75:$AN75),0)))*$I75","v":0},0,null,0,null,0]
[null,null,null,null,null,null,null,null,null,null,null,null,null,0,0,0,0,0,0,0,0,0,0,0,0,0,0,null,0,{"$f":"IF(AC76=1,IF(AC$7=$K76,0,1),IF(AD$7=$J76,1,0))","v":0},0,0,0,0,0,0,0,0,0,0,null,{"$f":"$C76*$F76*SUM(Header!$C$13:$C$15)","v":0},{"$f":"IF($G76>15,15,$G76)*$C76*Header!$C$16","v":0},{"$f":"IF($F76>15,15,$F76)*$C76*Header!$C$17","v":0},{"$f":"IF(Header!$C$12=\"Summer\",SUM($AC76:$AG76),IF(Header!$C$12=\"Autumn\",SUM($AC76:$AF76),IF(Header!$C$12=\"Spring\",SUM($AC76:$AE76),0)))*$I76","v":0},0,null,{"$f":"$D76*$F76*SUM(Header!$D$13:$D$15)","v":0},{"$f":"IF($G76>15,15,$G76)*$D76*Header!$D$16","v":0},{"$f":"IF($F76>15,15,$F76)*$D76*Header!$D$17","v":0},{"$f":"IF(Header!$C$12=\"Summer\",SUM($AH76:$AK76),IF(Header!$C$12=\"Autumn\",SUM($AG76:$AI76),IF(Header!$C$12=\"Spring\",SUM($AF76:$AJ76),0)))*$I76","v":0},0,null,{"$f":"$E76*$F76*SUM(Header!$E$13:$E$15)","v":0},{"$f":"IF($G76>15,15,$G76)*$E76*Header!$E$16","v":0},{"$f":"IF($F76>15,15,$F76)*$E76*Header!$E$17","v":0},{"$f":"IF(Header!$C$12=\"Summer\",SUM($AL76:$AN76),IF(Header!$C$12=\"Autumn\",SUM($AJ76:$AN76),IF(Header!$C$12=\"Spring\",SUM($AK76:$AN76),0)))*$I76","v":0},0,null,0,null,0]
[null,null,null,null,null,null,null,null,null,null,null,null,null,0,0,0,0,0,0,0,0,0,0,0,0,0,0,null,0,{"$f":"IF(AC77=1,IF(AC$7=$K77,0,1),IF(AD$7=$J77,1,0))","v":0},0,0,0,0,0,0,0,0,0,0,null,{"$f":"$C77*$F77*SUM(Header!$C$13:$C$15)","v":0},{"$f":"IF($G77>15,15,$G77)*$C77*Header!$C$16","v":0},{"$f":"IF($F77>15,15,$F77)*$C77*Header!$C$17","v":0},{"$f":"IF(Header!$C$12=\"Summer\",SUM($AC77:$AG77),IF(Header!$C$12=\"Autumn\",SUM($AC77:$AF77),IF(Header!$C$12=\"Spring\",SUM($AC77:$AE77),0)))*$I77","v":0},0,null,{"$f":"$D77*$F77*SUM(Header!$D$13:$D$15)","v":0},{"$f":"IF($G77>15,15,$G77)*$D77*Header!$D$16","v":0},{"$f":"IF($F77>15,15,$F77)*$D77*Header!$D$17","v":0},{"$f":"IF(Header!$C$12=\"Summer\",SUM($AH77:$AK77),IF(Header!$C$12=\"Autumn\",SUM($AG77:$AI77),IF(Header!$C$12=\"Spring\",SUM($AF77:$AJ77),0)))*$I77","v":0},0,null,{"$f":"$E77*$F77*SUM(Header!$E$13:$E$15)","v":0},{"$f":"IF($G77>15,15,$G77)*$E77*Header!$E$16","v":0},{"$f":"IF($F77>15,15,$F77)*$E77*Header!$E$17","v":0},{"$f":"IF(Header!$C$12=\"Summer\",SUM($AL77:$AN77),IF(Header!$C$12=\"Autumn\",SUM($AJ77:$AN77),IF(Header!$C$12=\"Spring\",SUM($AK77:$AN77),0)))*$I77","v":0},0,null,0,null,0]
[null,null,null,null,null,null,null,null,null,null,null,null,null,0,0,0,0,0,0,0,0,0,0,0,0,0,0,null,0,{"$f":"IF(AC78=1,IF(AC$7=$K78,0,1),IF(AD$7=$J78,1,0))","v":0},0,0,0,0,0,0,0,0,0,0,null,{"$f":"$C78*$F78*SUM(Header!$C$13:$C$15)","v":0},{"$f":"IF($G78>15,15,$G78)*$C78*Header!$C$16","v":0},{"$f":"IF($F78>15,15,$F78)*$C78*Header!$C$17","v":0},{"$f":"IF(Header!$C$12=\"Summer\",SUM($AC78:$AG78),IF(Header!$C$12=\"Autumn\",SUM($AC78:$AF78),IF(Header!$C$12=\"Spring\",SUM($AC78:$AE78),0)))*$I78","v":0},0,null,{"$f":"$D78*$F78*SUM(Header!$D$13:$D$15)","v":0},{"$f":"IF($G78>15,15,$G78)*$D78*Header!$D$16","v":0},{"$f":"IF($F78>15,15,$F78)*$D78*Header!$D$17","v":0},{"$f":"IF(Header!$C$12=\"Summer\",SUM($AH78:$AK78),IF(Header!$C$12=\"Autumn\",SUM($AG78:$AI78),IF(Header!$C$12=\"Spring\",SUM($AF78:$AJ78),0)))*$I78","v":0},0,null,{"$f":"$E78*$F78*SUM(Header!$E$13:$E$15)","v":0},{"$f":"IF($G78>15,15,$G78)*$E78*Header!$E$16","v":0},{"$f":"IF($F78>15,15,$F78)*$E78*Header!$E$17","v":0},{"$f":"IF(Header!$C$12=\"Summer\",SUM($AL78:$AN78),IF(Header!$C$12=\"Autumn\",SUM($AJ78:$AN78),IF(Header!$C$12=\"Spring\",SUM($AK78:$AN78),0)))*$I78","v":0},0,null,0,null,0]
[null,null,null,null,null,null,null,null,null,null,null,null,null,0,0,0,0,0,0,0,0,0,0,0,0,0,0,null,0,{"$f":"IF(AC79=1,IF(AC$7=$K79,0,1),IF(AD$7=$J79,1,0))","v":0},0,0,0,0,0,0,0,0,0,0,null,{"$f":"$C79*$F79*SUM(Header!$C$13:$C$15)","v":0},{"$f":"IF($G79>15,15,$G79)*$C79*Header!$C$16","v":0},{"$f":"IF($F79>15,15,$F79)*$C79*Header!$C$17","v":0},{"$f":"IF(Header!$C$12=\"Summer\",SUM($AC79:$AG79),IF(Header!$C$12=\"Autumn\",SUM($AC79:$AF79),IF(Header!$C$12=\"Spring\",SUM($AC79:$AE79),0)))*$I79","v":0},0,null,{"$f":"$D79*$F79*SUM(Header!$D$13:$D$15)","v":0},{"$f":"IF($G79>15,15,$G79)*$D79*Header!$D$16","v":0},{"$f":"IF($F79>15,15,$F79)*$D79*Header!$D$17","v":0},{"$f":"IF(Header!$C$12=\"Summer\",SUM($AH79:$AK79),IF(Header!$C$12=\"Autumn\",SUM($AG79:$AI79),IF(Header!$C$12=\"Spring\",SUM($AF79:$AJ79),0)))*$I79","v":0},0,null,{"$f":"$E79*$F79*SUM(Header!$E$13:$E$15)","v":0},{"$f":"IF($G79>15,15,$G79)*$E79*Header!$E$16","v":0},{"$f":"IF($F79>15,15,$F79)*$E79*Header!$E$17","v":0},{"$f":"IF(Header!$C$12=\"Summer\",SUM($AL79:$AN79),IF(Header!$C$12=\"Autumn\",SUM($AJ79:$AN79),IF(Header!$C$12=\"Spring\",SUM($AK79:$AN79),0)))*$I79","v":0},0,null,0,null,0]
[null,null,null,null,null,null,null,null,null,null,null,null,null,0,0,0,0,0,0,0,0,0,0,0,0,0,0,null,0,{"$f":"IF(AC80=1,IF(AC$7=$K80,0,1),IF(AD$7=$J80,1,0))","v":0},0,0,0,0,0,0,0,0,0,0,null,{"$f":"$C80*$F80*SUM(Header!$C$13:$C$15)","v":0},{"$f":"IF($G80>15,15,$G80)*$C80*Header!$C$16","v":0},{"$f":"IF($F80>15,15,$F80)*$C80*Header!$C$17","v":0},{"$f":"IF(Header!$C$12=\"Summer\",SUM($AC80:$AG80),IF(Header!$C$12=\"Autumn\",SUM($AC80:$AF80),IF(Header!$C$12=\"Spring\",SUM($AC80:$AE80),0)))*$I80","v":0},0,null,{"$f":"$D80*$F80*SUM(Header!$D$13:$D$15)","v":0},{"$f":"IF($G80>15,15,$G80)*$D80*Header!$D$16","v":0},{"$f":"IF($F80>15,15,$F80)*$D80*Header!$D$17","v":0},{"$f":"IF(Header!$C$12=\"Summer\",SUM($AH80:$AK80),IF(Header!$C$12=\"Autumn\",SUM($AG80:$AI80),IF(Header!$C$12=\"Spring\",SUM($AF80:$AJ80),0)))*$I80","v":0},0,null,{"$f":"$E80*$F80*SUM(Header!$E$13:$E$15)","v":0},{"$f":"IF($G80>15,15,$G80)*$E80*Header!$E$16","v":0},{"$f":"IF($F80>15,15,$F80)*$E80*Header!$E$17","v":0},{"$f":"IF(Header!$C$12=\"Summer\",SUM($AL80:$AN80),IF(Header!$C$12=\"Autumn\",SUM($AJ80:$AN80),IF(Header!$C$12=\"Spring\",SUM($AK80:$AN80),0)))*$I80","v":0},0,null,0,null,0]
[null,null,null,null,null,null,null,null,null,null,null,null,null,0,0,0,0,0,0,0,0,0,0,0,0,0,0,null,0,{"$f":"IF(AC81=1,IF(AC$7=$K81,0,1),IF(AD$7=$J81,1,0))","v":0},0,0,0,0,0,0,0,0,0,0,null,{"$f":"$C81*$F81*SUM(Header!$C$13:$C$15)","v":0},{"$f":"IF($G81>15,15,$G81)*$C81*Header!$C$16","v":0},{"$f":"IF($F81>15,15,$F81)*$C81*Header!$C$17","v":0},{"$f":"IF(Header!$C$12=\"Summer\",SUM($AC81:$AG81),IF(Header!$C$12=\"Autumn\",SUM($AC81:$AF81),IF(Header!$C$12=\"Spring\",SUM($AC81:$AE81),0)))*$I81","v":0},0,null,{"$f":"$D81*$F81*SUM(Header!$D$13:$D$15)","v":0},{"$f":"IF($G81>15,15,$G81)*$D81*Header!$D$16","v":0},{"$f":"IF($F81>15,15,$F81)*$D81*Header!$D$17","v":0},{"$f":"IF(Header!$C$12=\"Summer\",SUM($AH81:$AK81),IF(Header!$C$12=\"Autumn\",SUM($AG81:$AI81),IF(Header!$C$12=\"Spring\",SUM($AF81:$AJ81),0)))*$I81","v":0},0,null,{"$f":"$E81*$F81*SUM(Header!$E$13:$E$15)","v":0},{"$f":"IF($G81>15,15,$G81)*$E81*Header!$E$16","v":0},{"$f":"IF($F81>15,15,$F81)*$E81*Header!$E$17","v":0},{"$f":"IF(Header!$C$12=\"Summer\",SUM($AL81:$AN81),IF(Header!$C$12=\"Autumn\",SUM($AJ81:$AN81),IF(Header!$C$12=\"Spring\",SUM($AK81:$AN81),0)))*$I81","v":0},0,null,0,null,0]
[null,null,null,null,null,null,null,null,null,null,null,null,null,0,0,0,0,0,0,0,0,0,0,0,0,0,0,null,0,{"$f":"IF(AC82=1,IF(AC$7=$K82,0,1),IF(AD$7=$J82,1,0))","v":0},0,0,0,0,0,0,0,0,0,0,null,{"$f":"$C82*$F82*SUM(Header!$C$13:$C$15)","v":0},{"$f":"IF($G82>15,15,$G82)*$C82*Header!$C$16","v":0},{"$f":"IF($F82>15,15,$F82)*$C82*Header!$C$17","v":0},{"$f":"IF(Header!$C$12=\"Summer\",SUM($AC82:$AG82),IF(Header!$C$12=\"Autumn\",SUM($AC82:$AF82),IF(Header!$C$12=\"Spring\",SUM($AC82:$AE82),0)))*$I82","v":0},0,null,{"$f":"$D82*$F82*SUM(Header!$D$13:$D$15)","v":0},{"$f":"IF($G82>15,15,$G82)*$D82*Header!$D$16","v":0},{"$f":"IF($F82>15,15,$F82)*$D82*Header!$D$17","v":0},{"$f":"IF(Header!$C$12=\"Summer\",SUM($AH82:$AK82),IF(Header!$C$12=\"Autumn\",SUM($AG82:$AI82),IF(Header!$C$12=\"Spring\",SUM($AF82:$AJ82),0)))*$I82","v":0},0,null,{"$f":"$E82*$F82*SUM(Header!$E$13:$E$15)","v":0},{"$f":"IF($G82>15,15,$G82)*$E82*Header!$E$16","v":0},{"$f":"IF($F82>15,15,$F82)*$E82*Header!$E$17","v":0},{"$f":"IF(Header!$C$12=\"Summer\",SUM($AL82:$AN82),IF(Header!$C$12=\"Autumn\",SUM($AJ82:$AN82),IF(Header!$C$12=\"Spring\",SUM($AK82:$AN82),0)))*$I82","v":0},0,null,0,null,0]
[null,null,null,null,null,null,null,null,null,null,null,null,null,0,0,0,0,0,0,0,0,0,0,0,0,0,0,null,0,{"$f":"IF(AC83=1,IF(AC$7=$K83,0,1),IF(AD$7=$J83,1,0))","v":0},0,0,0,0,0,0,0,0,0,0,null,{"$f":"$C83*$F83*SUM(Header!$C$13:$C$15)","v":0},{"$f":"IF($G83>15,15,$G83)*$C83*Header!$C$16","v":0},{"$f":"IF($F83>15,15,$F83)*$C83*Header!$C$17","v":0},{"$f":"IF(Header!$C$12=\"Summer\",SUM($AC83:$AG83),IF(Header!$C$12=\"Autumn\",SUM($AC83:$AF83),IF(Header!$C$12=\"Spring\",SUM($AC83:$AE83),0)))*$I83","v":0},0,null,{"$f":"$D83*$F83*SUM(Header!$D$13:$D$15)","v":0},{"$f":"IF($G83>15,15,$G83)*$D83*Header!$D$16","v":0},{"$f":"IF($F83>15,15,$F83)*$D83*Header!$D$17","v":0},{"$f":"IF(Header!$C$12=\"Summer\",SUM($AH83:$AK83),IF(Header!$C$12=\"Autumn\",SUM($AG83:$AI83),IF(Header!$C$12=\"Spring\",SUM($AF83:$AJ83),0)))*$I83","v":0},0,null,{"$f":"$E83*$F83*SUM(Header!$E$13:$E$15)","v":0},{"$f":"IF($G83>15,15,$G83)*$E83*Header!$E$16","v":0},{"$f":"IF($F83>15,15,$F83)*$E83*Header!$E$17","v":0},{"$f":"IF(Header!$C$12=\"Summer\",SUM($AL83:$AN83),IF(Header!$C$12=\"Autumn\",SUM($AJ83:$AN83),IF(Header!$C$12=\"Spring\",SUM($AK83:$AN83),0)))*$I83","v":0},0,null,0,null,0]
[null,null,null,null,null,null,null,null,null,null,null,null,null,0,0,0,0,0,0,0,0,0,0,0,0,0,0,null,0,{"$f":"IF(AC84=1,IF(AC$7=$K84,0,1),IF(AD$7=$J84,1,0))","v":0},0,0,0,0,0,0,0,0,0,0,null,{"$f":"$C84*$F84*SUM(Header!$C$13:$C$15)","v":0},{"$f":"IF($G84>15,15,$G84)*$C84*Header!$C$16","v":0},{"$f":"IF($F84>15,15,$F84)*$C84*Header!$C$17","v":0},{"$f":"IF(Header!$C$12=\"Summer\",SUM($AC84:$AG84),IF(Header!$C$12=\"Autumn\",SUM($AC84:$AF84),IF(Header!$C$12=\"Spring\",SUM($AC84:$AE84),0)))*$I84","v":0},0,null,{"$f":"$D84*$F84*SUM(Header!$D$13:$D$15)","v":0},{"$f":"IF($G84>15,15,$G84)*$D84*Header!$D$16","v":0},{"$f":"IF($F84>15,15,$F84)*$D84*Header!$D$17","v":0},{"$f":"IF(Header!$C$12=\"Summer\",SUM($AH84:$AK84),IF(Header!$C$12=\"Autumn\",SUM($AG84:$AI84),IF(Header!$C$12=\"Spring\",SUM($AF84:$AJ84),0)))*$I84","v":0},0,null,{"$f":"$E84*$F84*SUM(Header!$E$13:$E$15)","v":0},{"$f":"IF($G84>15,15,$G84)*$E84*Header!$E$16","v":0},{"$f":"IF($F84>15,15,$F84)*$E84*Header!$E$17","v":0},{"$f":"IF(Header!$C$12=\"Summer\",SUM($AL84:$AN84),IF(Header!$C$12=\"Autumn\",SUM($AJ84:$AN84),IF(Header!$C$12=\"Spring\",SUM($AK84:$AN84),0)))*$I84","v":0},0,null,0,null,0]
[null,null,null,null,null,null,null,null,null,null,null,null,null,0,0,0,0,0,0,0,0,0,0,0,0,0,0,null,0,{"$f":"IF(AC85=1,IF(AC$7=$K85,0,1),IF(AD$7=$J85,1,0))","v":0},0,0,0,0,0,0,0,0,0,0,null,{"$f":"$C85*$F85*SUM(Header!$C$13:$C$15)","v":0},{"$f":"IF($G85>15,15,$G85)*$C85*Header!$C$16","v":0},{"$f":"IF($F85>15,15,$F85)*$C85*Header!$C$17","v":0},{"$f":"IF(Header!$C$12=\"Summer\",SUM($AC85:$AG85),IF(Header!$C$12=\"Autumn\",SUM($AC85:$AF85),IF(Header!$C$12=\"Spring\",SUM($AC85:$AE85),0)))*$I85","v":0},0,null,{"$f":"$D85*$F85*SUM(Header!$D$13:$D$15)","v":0},{"$f":"IF($G85>15,15,$G85)*$D85*Header!$D$16","v":0},{"$f":"IF($F85>15,15,$F85)*$D85*Header!$D$17","v":0},{"$f":"IF(Header!$C$12=\"Summer\",SUM($AH85:$AK85),IF(Header!$C$12=\"Autumn\",SUM($AG85:$AI85),IF(Header!$C$12=\"Spring\",SUM($AF85:$AJ85),0)))*$I85","v":0},0,null,{"$f":"$E85*$F85*SUM(Header!$E$13:$E$15)","v":0},{"$f":"IF($G85>15,15,$G85)*$E85*Header!$E$16","v":0},{"$f":"IF($F85>15,15,$F85)*$E85*Header!$E$17","v":0},{"$f":"IF(Header!$C$12=\"Summer\",SUM($AL85:$AN85),IF(Header!$C$12=\"Autumn\",SUM($AJ85:$AN85),IF(Header!$C$12=\"Spring\",SUM($AK85:$AN85),0)))*$I85","v":0},0,null,0,null,0]
[null,null,null,null,null,null,null,null,null,null,null,null,null,0,0,0,0,0,0,0,0,0,0,0,0,0,0,null,0,{"$f":"IF(AC86=1,IF(AC$7=$K86,0,1),IF(AD$7=$J86,1,0))","v":0},0,0,0,0,0,0,0,0,0,0,null,{"$f":"$C86*$F86*SUM(Header!$C$13:$C$15)","v":0},{"$f":"IF($G86>15,15,$G86)*$C86*Header!$C$16","v":0},{"$f":"IF($F86>15,15,$F86)*$C86*Header!$C$17","v":0},{"$f":"IF(Header!$C$12=\"Summer\",SUM($AC86:$AG86),IF(Header!$C$12=\"Autumn\",SUM($AC86:$AF86),IF(Header!$C$12=\"Spring\",SUM($AC86:$AE86),0)))*$I86","v":0},0,null,{"$f":"$D86*$F86*SUM(Header!$D$13:$D$15)","v":0},{"$f":"IF($G86>15,15,$G86)*$D86*Header!$D$16","v":0},{"$f":"IF($F86>15,15,$F86)*$D86*Header!$D$17","v":0},{"$f":"IF(Header!$C$12=\"Summer\",SUM($AH86:$AK86),IF(Header!$C$12=\"Autumn\",SUM($AG86:$AI86),IF(Header!$C$12=\"Spring\",SUM($AF86:$AJ86),0)))*$I86","v":0},0,null,{"$f":"$E86*$F86*SUM(Header!$E$13:$E$15)","v":0},{"$f":"IF($G86>15,15,$G86)*$E86*Header!$E$16","v":0},{"$f":"IF($F86>15,15,$F86)*$E86*Header!$E$17","v":0},{"$f":"IF(Header!$C$12=\"Summer\",SUM($AL86:$AN86),IF(Header!$C$12=\"Autumn\",SUM($AJ86:$AN86),IF(Header!$C$12=\"Spring\",SUM($AK86:$AN86),0)))*$I86","v":0},0,null,0,null,0]
[null,null,null,null,null,null,null,null,null,null,null,null,null,0,0,0,0,0,0,0,0,0,0,0,0,0,0,null,0,{"$f":"IF(AC87=1,IF(AC$7=$K87,0,1),IF(AD$7=$J87,1,0))","v":0},0,0,0,0,0,0,0,0,0,0,null,{"$f":"$C87*$F87*SUM(Header!$C$13:$C$15)","v":0},{"$f":"IF($G87>15,15,$G87)*$C87*Header!$C$16","v":0},{"$f":"IF($F87>15,15,$F87)*$C87*Header!$C$17","v":0},{"$f":"IF(Header!$C$12=\"Summer\",SUM($AC87:$AG87),IF(Header!$C$12=\"Autumn\",SUM($AC87:$AF87),IF(Header!$C$12=\"Spring\",SUM($AC87:$AE87),0)))*$I87","v":0},0,null,{"$f":"$D87*$F87*SUM(Header!$D$13:$D$15)","v":0},{"$f":"IF($G87>15,15,$G87)*$D87*Header!$D$16","v":0},{"$f":"IF($F87>15,15,$F87)*$D87*Header!$D$17","v":0},{"$f":"IF(Header!$C$12=\"Summer\",SUM($AH87:$AK87),IF(Header!$C$12=\"Autumn\",SUM($AG87:$AI87),IF(Header!$C$12=\"Spring\",SUM($AF87:$AJ87),0)))*$I87","v":0},0,null,{"$f":"$E87*$F87*SUM(Header!$E$13:$E$15)","v":0},{"$f":"IF($G87>15,15,$G87)*$E87*Header!$E$16","v":0},{"$f":"IF($F87>15,15,$F87)*$E87*Header!$E$17","v":0},{"$f":"IF(Header!$C$12=\"Summer\",SUM($AL87:$AN87),IF(Header!$C$12=\"Autumn\",SUM($AJ87:$AN87),IF(Header!$C$12=\"Spring\",SUM($AK87:$AN87),0)))*$I87","v":0},0,null,0,null,0]
[null,null,null,null,null,null,null,null,null,null,null,null,null,0,0,0,0,0,0,0,0,0,0,0,0,0,0,null,0,{"$f":"IF(AC88=1,IF(AC$7=$K88,0,1),IF(AD$7=$J88,1,0))","v":0},0,0,0,0,0,0,0,0,0,0,null,{"$f":"$C88*$F88*SUM(Header!$C$13:$C$15)","v":0},{"$f":"IF($G88>15,15,$G88)*$C88*Header!$C$16","v":0},{"$f":"IF($F88>15,15,$F88)*$C88*Header!$C$17","v":0},{"$f":"IF(Header!$C$12=\"Summer\",SUM($AC88:$AG88),IF(Header!$C$12=\"Autumn\",SUM($AC88:$AF88),IF(Header!$C$12=\"Spring\",SUM($AC88:$AE88),0)))*$I88","v":0},0,null,{"$f":"$D88*$F88*SUM(Header!$D$13:$D$15)","v":0},{"$f":"IF($G88>15,15,$G88)*$D88*Header!$D$16","v":0},{"$f":"IF($F88>15,15,$F88)*$D88*Header!$D$17","v":0},{"$f":"IF(Header!$C$12=\"Summer\",SUM($AH88:$AK88),IF(Header!$C$12=\"Autumn\",SUM($AG88:$AI88),IF(Header!$C$12=\"Spring\",SUM($AF88:$AJ88),0)))*$I88","v":0},0,null,{"$f":"$E88*$F88*SUM(Header!$E$13:$E$15)","v":0},{"$f":"IF($G88>15,15,$G88)*$E88*Header!$E$16","v":0},{"$f":"IF($F88>15,15,$F88)*$E88*Header!$E$17","v":0},{"$f":"IF(Header!$C$12=\"Summer\",SUM($AL88:$AN88),IF(Header!$C$12=\"Autumn\",SUM($AJ88:$AN88),IF(Header!$C$12=\"Spring\",SUM($AK88:$AN88),0)))*$I88","v":0},0,null,0,null,0]
[null,null,null,null,null,null,null,null,null,null,null,null,null,0,0,0,0,0,0,0,0,0,0,0,0,0,0,null,0,{"$f":"IF(AC89=1,IF(AC$7=$K89,0,1),IF(AD$7=$J89,1,0))","v":0},0,0,0,0,0,0,0,0,0,0,null,{"$f":"$C89*$F89*SUM(Header!$C$13:$C$15)","v":0},{"$f":"IF($G89>15,15,$G89)*$C89*Header!$C$16","v":0},{"$f":"IF($F89>15,15,$F89)*$C89*Header!$C$17","v":0},{"$f":"IF(Header!$C$12=\"Summer\",SUM($AC89:$AG89),IF(Header!$C$12=\"Autumn\",SUM($AC89:$AF89),IF(Header!$C$12=\"Spring\",SUM($AC89:$AE89),0)))*$I89","v":0},0,null,{"$f":"$D89*$F89*SUM(Header!$D$13:$D$15)","v":0},{"$f":"IF($G89>15,15,$G89)*$D89*Header!$D$16","v":0},{"$f":"IF($F89>15,15,$F89)*$D89*Header!$D$17","v":0},{"$f":"IF(Header!$C$12=\"Summer\",SUM($AH89:$AK89),IF(Header!$C$12=\"Autumn\",SUM($AG89:$AI89),IF(Header!$C$12=\"Spring\",SUM($AF89:$AJ89),0)))*$I89","v":0},0,null,{"$f":"$E89*$F89*SUM(Header!$E$13:$E$15)","v":0},{"$f":"IF($G89>15,15,$G89)*$E89*Header!$E$16","v":0},{"$f":"IF($F89>15,15,$F89)*$E89*Header!$E$17","v":0},{"$f":"IF(Header!$C$12=\"Summer\",SUM($AL89:$AN89),IF(Header!$C$12=\"Autumn\",SUM($AJ89:$AN89),IF(Header!$C$12=\"Spring\",SUM($AK89:$AN89),0)))*$I89","v":0},0,null,0,null,0]
[null,null,null,null,null,null,null,null,null,null,null,null,null,0,0,0,0,0,0,0,0,0,0,0,0,0,0,null,0,{"$f":"IF(AC90=1,IF(AC$7=$K90,0,1),IF(AD$7=$J90,1,0))","v":0},0,0,0,0,0,0,0,0,0,0,null,{"$f":"$C90*$F90*SUM(Header!$C$13:$C$15)","v":0},{"$f":"IF($G90>15,15,$G90)*$C90*Header!$C$16","v":0},{"$f":"IF($F90>15,15,$F90)*$C90*Header!$C$17","v":0},{"$f":"IF(Header!$C$12=\"Summer\",SUM($AC90:$AG90),IF(Header!$C$12=\"Autumn\",SUM($AC90:$AF90),IF(Header!$C$12=\"Spring\",SUM($AC90:$AE90),0)))*$I90","v":0},0,null,{"$f":"$D90*$F90*SUM(Header!$D$13:$D$15)","v":0},{"$f":"IF($G90>15,15,$G90)*$D90*Header!$D$16","v":0},{"$f":"IF($F90>15,15,$F90)*$D90*Header!$D$17","v":0},{"$f":"IF(Header!$C$12=\"Summer\",SUM($AH90:$AK90),IF(Header!$C$12=\"Autumn\",SUM($AG90:$AI90),IF(Header!$C$12=\"Spring\",SUM($AF90:$AJ90),0)))*$I90","v":0},0,null,{"$f":"$E90*$F90*SUM(Header!$E$13:$E$15)","v":0},{"$f":"IF($G90>15,15,$G90)*$E90*Header!$E$16","v":0},{"$f":"IF($F90>15,15,$F90)*$E90*Header!$E$17","v":0},{"$f":"IF(Header!$C$12=\"Summer\",SUM($AL90:$AN90),IF(Header!$C$12=\"Autumn\",SUM($AJ90:$AN90),IF(Header!$C$12=\"Spring\",SUM($AK90:$AN90),0)))*$I90","v":0},0,null,0,null,0]
[null,null,null,null,null,null,null,null,null,null,null,null,null,0,0,0,0,0,0,0,0,0,0,0,0,0,0,null,0,{"$f":"IF(AC91=1,IF(AC$7=$K91,0,1),IF(AD$7=$J91,1,0))","v":0},0,0,0,0,0,0,0,0,0,0,null,{"$f":"$C91*$F91*SUM(Header!$C$13:$C$15)","v":0},{"$f":"IF($G91>15,15,$G91)*$C91*Header!$C$16","v":0},{"$f":"IF($F91>15,15,$F91)*$C91*Header!$C$17","v":0},{"$f":"IF(Header!$C$12=\"Summer\",SUM($AC91:$AG91),IF(Header!$C$12=\"Autumn\",SUM($AC91:$AF91),IF(Header!$C$12=\"Spring\",SUM($AC91:$AE91),0)))*$I91","v":0},0,null,{"$f":"$D91*$F91*SUM(Header!$D$13:$D$15)","v":0},{"$f":"IF($G91>15,15,$G91)*$D91*Header!$D$16","v":0},{"$f":"IF($F91>15,15,$F91)*$D91*Header!$D$17","v":0},{"$f":"IF(Header!$C$12=\"Summer\",SUM($AH91:$AK91),IF(Header!$C$12=\"Autumn\",SUM($AG91:$AI91),IF(Header!$C$12=\"Spring\",SUM($AF91:$AJ91),0)))*$I91","v":0},0,null,{"$f":"$E91*$F91*SUM(Header!$E$13:$E$15)","v":0},{"$f":"IF($G91>15,15,$G91)*$E91*Header!$E$16","v":0},{"$f":"IF($F91>15,15,$F91)*$E91*Header!$E$17","v":0},{"$f":"IF(Header!$C$12=\"Summer\",SUM($AL91:$AN91),IF(Header!$C$12=\"Autumn\",SUM($AJ91:$AN91),IF(Header!$C$12=\"Spring\",SUM($AK91:$AN91),0)))*$I91","v":0},0,null,0,null,0]
[null,null,null,null,null,null,null,null,null,null,null,null,null,0,0,0,0,0,0,0,0,0,0,0,0,0,0,null,0,{"$f":"IF(AC92=1,IF(AC$7=$K92,0,1),IF(AD$7=$J92,1,0))","v":0},0,0,0,0,0,0,0,0,0,0,null,{"$f":"$C92*$F92*SUM(Header!$C$13:$C$15)","v":0},{"$f":"IF($G92>15,15,$G92)*$C92*Header!$C$16","v":0},{"$f":"IF($F92>15,15,$F92)*$C92*Header!$C$17","v":0},{"$f":"IF(Header!$C$12=\"Summer\",SUM($AC92:$AG92),IF(Header!$C$12=\"Autumn\",SUM($AC92:$AF92),IF(Header!$C$12=\"Spring\",SUM($AC92:$AE92),0)))*$I92","v":0},0,null,{"$f":"$D92*$F92*SUM(Header!$D$13:$D$15)","v":0},{"$f":"IF($G92>15,15,$G92)*$D92*Header!$D$16","v":0},{"$f":"IF($F92>15,15,$F92)*$D92*Header!$D$17","v":0},{"$f":"IF(Header!$C$12=\"Summer\",SUM($AH92:$AK92),IF(Header!$C$12=\"Autumn\",SUM($AG92:$AI92),IF(Header!$C$12=\"Spring\",SUM($AF92:$AJ92),0)))*$I92","v":0},0,null,{"$f":"$E92*$F92*SUM(Header!$E$13:$E$15)","v":0},{"$f":"IF($G92>15,15,$G92)*$E92*Header!$E$16","v":0},{"$f":"IF($F92>15,15,$F92)*$E92*Header!$E$17","v":0},{"$f":"IF(Header!$C$12=\"Summer\",SUM($AL92:$AN92),IF(Header!$C$12=\"Autumn\",SUM($AJ92:$AN92),IF(Header!$C$12=\"Spring\",SUM($AK92:$AN92),0)))*$I92","v":0},0,null,0,null,0]
[null,null,null,null,null,null,null,null,null,null,null,null,null,0,0,0,0,0,0,0,0,0,0,0,0,0,0,null,0,{"$f":"IF(AC93=1,IF(AC$7=$K93,0,1),IF(AD$7=$J93,1,0))","v":0},0,0,0,0,0,0,0,0,0,0,null,{"$f":"$C93*$F93*SUM(Header!$C$13:$C$15)","v":0},{"$f":"IF($G93>15,15,$G93)*$C93*Header!$C$16","v":0},{"$f":"IF($F93>15,15,$F93)*$C93*Header!$C$17","v":0},{"$f":"IF(Header!$C$12=\"Summer\",SUM($AC93:$AG93),IF(Header!$C$12=\"Autumn\",SUM($AC93:$AF93),IF(Header!$C$12=\"Spring\",SUM($AC93:$AE93),0)))*$I93","v":0},0,null,{"$f":"$D93*$F93*SUM(Header!$D$13:$D$15)","v":0},{"$f":"IF($G93>15,15,$G93)*$D93*Header!$D$16","v":0},{"$f":"IF($F93>15,15,$F93)*$D93*Header!$D$17","v":0},{"$f":"IF(Header!$C$12=\"Summer\",SUM($AH93:$AK93),IF(Header!$C$12=\"Autumn\",SUM($AG93:$AI93),IF(Header!$C$12=\"Spring\",SUM($AF93:$AJ93),0)))*$I93","v":0},0,null,{"$f":"$E93*$F93*SUM(Header!$E$13:$E$15)","v":0},{"$f":"IF($G93>15,15,$G93)*$E93*Header!$E$16","v":0},{"$f":"IF($F93>15,15,$F93)*$E93*Header!$E$17","v":0},{"$f":"IF(Header!$C$12=\"Summer\",SUM($AL93:$AN93),IF(Header!$C$12=\"Autumn\",SUM($AJ93:$AN93),IF(Header!$C$12=\"Spring\",SUM($AK93:$AN93),0)))*$I93","v":0},0,null,0,null,0]
[null,null,null,null,null,null,null,null,null,null,null,null,null,0,0,0,0,0,0,0,0,0,0,0,0,0,0,null,0,{"$f":"IF(AC94=1,IF(AC$7=$K94,0,1),IF(AD$7=$J94,1,0))","v":0},0,0,0,0,0,0,0,0,0,0,null,{"$f":"$C94*$F94*SUM(Header!$C$13:$C$15)","v":0},{"$f":"IF($G94>15,15,$G94)*$C94*Header!$C$16","v":0},{"$f":"IF($F94>15,15,$F94)*$C94*Header!$C$17","v":0},{"$f":"IF(Header!$C$12=\"Summer\",SUM($AC94:$AG94),IF(Header!$C$12=\"Autumn\",SUM($AC94:$AF94),IF(Header!$C$12=\"Spring\",SUM($AC94:$AE94),0)))*$I94","v":0},0,null,{"$f":"$D94*$F94*SUM(Header!$D$13:$D$15)","v":0},{"$f":"IF($G94>15,15,$G94)*$D94*Header!$D$16","v":0},{"$f":"IF($F94>15,15,$F94)*$D94*Header!$D$17","v":0},{"$f":"IF(Header!$C$12=\"Summer\",SUM($AH94:$AK94),IF(Header!$C$12=\"Autumn\",SUM($AG94:$AI94),IF(Header!$C$12=\"Spring\",SUM($AF94:$AJ94),0)))*$I94","v":0},0,null,{"$f":"$E94*$F94*SUM(Header!$E$13:$E$15)","v":0},{"$f":"IF($G94>15,15,$G94)*$E94*Header!$E$16","v":0},{"$f":"IF($F94>15,15,$F94)*$E94*Header!$E$17","v":0},{"$f":"IF(Header!$C$12=\"Summer\",SUM($AL94:$AN94),IF(Header!$C$12=\"Autumn\",SUM($AJ94:$AN94),IF(Header!$C$12=\"Spring\",SUM($AK94:$AN94),0)))*$I94","v":0},0,null,0,null,0]
[null,null,null,null,null,null,null,null,null,null,null,null,null,0,0,0,0,0,0,0,0,0,0,0,0,0,0,null,0,{"$f":"IF(AC95=1,IF(AC$7=$K95,0,1),IF(AD$7=$J95,1,0))","v":0},0,0,0,0,0,0,0,0,0,0,null,{"$f":"$C95*$F95*SUM(Header!$C$13:$C$15)","v":0},{"$f":"IF($G95>15,15,$G95)*$C95*Header!$C$16","v":0},{"$f":"IF($F95>15,15,$F95)*$C95*Header!$C$17","v":0},{"$f":"IF(Header!$C$12=\"Summer\",SUM($AC95:$AG95),IF(Header!$C$12=\"Autumn\",SUM($AC95:$AF95),IF(Header!$C$12=\"Spring\",SUM($AC95:$AE95),0)))*$I95","v":0},0,null,{"$f":"$D95*$F95*SUM(Header!$D$13:$D$15)","v":0},{"$f":"IF($G95>15,15,$G95)*$D95*Header!$D$16","v":0},{"$f":"IF($F95>15,15,$F95)*$D95*Header!$D$17","v":0},{"$f":"IF(Header!$C$12=\"Summer\",SUM($AH95:$AK95),IF(Header!$C$12=\"Autumn\",SUM($AG95:$AI95),IF(Header!$C$12=\"Spring\",SUM($AF95:$AJ95),0)))*$I95","v":0},0,null,{"$f":"$E95*$F95*SUM(Header!$E$13:$E$15)","v":0},{"$f":"IF($G95>15,15,$G95)*$E95*Header!$E$16","v":0},{"$f":"IF($F95>15,15,$F95)*$E95*Header!$E$17","v":0},{"$f":"IF(Header!$C$12=\"Summer\",SUM($AL95:$AN95),IF(Header!$C$12=\"Autumn\",SUM($AJ95:$AN95),IF(Header!$C$12=\"Spring\",SUM($AK95:$AN95),0)))*$I95","v":0},0,null,0,null,0]
[null,null,null,null,null,null,null,null,null,null,null,null,null,0,0,0,0,0,0,0,0,0,0,0,0,0,0,null,0,{"$f":"IF(AC96=1,IF(AC$7=$K96,0,1),IF(AD$7=$J96,1,0))","v":0},0,0,0,0,0,0,0,0,0,0,null,{"$f":"$C96*$F96*SUM(Header!$C$13:$C$15)","v":0},{"$f":"IF($G96>15,15,$G96)*$C96*Header!$C$16","v":0},{"$f":"IF($F96>15,15,$F96)*$C96*Header!$C$17","v":0},{"$f":"IF(Header!$C$12=\"Summer\",SUM($AC96:$AG96),IF(Header!$C$12=\"Autumn\",SUM($AC96:$AF96),IF(Header!$C$12=\"Spring\",SUM($AC96:$AE96),0)))*$I96","v":0},0,null,{"$f":"$D96*$F96*SUM(Header!$D$13:$D$15)","v":0},{"$f":"IF($G96>15,15,$G96)*$D96*Header!$D$16","v":0},{"$f":"IF($F96>15,15,$F96)*$D96*Header!$D$17","v":0},{"$f":"IF(Header!$C$12=\"Summer\",SUM($AH96:$AK96),IF(Header!$C$12=\"Autumn\",SUM($AG96:$AI96),IF(Header!$C$12=\"Spring\",SUM($AF96:$AJ96),0)))*$I96","v":0},0,null,{"$f":"$E96*$F96*SUM(Header!$E$13:$E$15)","v":0},{"$f":"IF($G96>15,15,$G96)*$E96*Header!$E$16","v":0},{"$f":"IF($F96>15,15,$F96)*$E96*Header!$E$17","v":0},{"$f":"IF(Header!$C$12=\"Summer\",SUM($AL96:$AN96),IF(Header!$C$12=\"Autumn\",SUM($AJ96:$AN96),IF(Header!$C$12=\"Spring\",SUM($AK96:$AN96),0)))*$I96","v":0},0,null,0,null,0]
[null,null,null,null,null,null,null,null,null,null,null,null,null,0,0,0,0,0,0,0,0,0,0,0,0,0,0,null,0,{"$f":"IF(AC97=1,IF(AC$7=$K97,0,1),IF(AD$7=$J97,1,0))","v":0},0,0,0,0,0,0,0,0,0,0,null,{"$f":"$C97*$F97*SUM(Header!$C$13:$C$15)","v":0},{"$f":"IF($G97>15,15,$G97)*$C97*Header!$C$16","v":0},{"$f":"IF($F97>15,15,$F97)*$C97*Header!$C$17","v":0},{"$f":"IF(Header!$C$12=\"Summer\",SUM($AC97:$AG97),IF(Header!$C$12=\"Autumn\",SUM($AC97:$AF97),IF(Header!$C$12=\"Spring\",SUM($AC97:$AE97),0)))*$I97","v":0},0,null,{"$f":"$D97*$F97*SUM(Header!$D$13:$D$15)","v":0},{"$f":"IF($G97>15,15,$G97)*$D97*Header!$D$16","v":0},{"$f":"IF($F97>15,15,$F97)*$D97*Header!$D$17","v":0},{"$f":"IF(Header!$C$12=\"Summer\",SUM($AH97:$AK97),IF(Header!$C$12=\"Autumn\",SUM($AG97:$AI97),IF(Header!$C$12=\"Spring\",SUM($AF97:$AJ97),0)))*$I97","v":0},0,null,{"$f":"$E97*$F97*SUM(Header!$E$13:$E$15)","v":0},{"$f":"IF($G97>15,15,$G97)*$E97*Header!$E$16","v":0},{"$f":"IF($F97>15,15,$F97)*$E97*Header!$E$17","v":0},{"$f":"IF(Header!$C$12=\"Summer\",SUM($AL97:$AN97),IF(Header!$C$12=\"Autumn\",SUM($AJ97:$AN97),IF(Header!$C$12=\"Spring\",SUM($AK97:$AN97),0)))*$I97","v":0},0,null,0,null,0]
[null,null,null,null,null,null,null,null,null,null,null,null,null,0,0,0,0,0,0,0,0,0,0,0,0,0,0,null,0,{"$f":"IF(AC98=1,IF(AC$7=$K98,0,1),IF(AD$7=$J98,1,0))","v":0},0,0,0,0,0,0,0,0,0,0,null,{"$f":"$C98*$F98*SUM(Header!$C$13:$C$15)","v":0},{"$f":"IF($G98>15,15,$G98)*$C98*Header!$C$16","v":0},{"$f":"IF($F98>15,15,$F98)*$C98*Header!$C$17","v":0},{"$f":"IF(Header!$C$12=\"Summer\",SUM($AC98:$AG98),IF(Header!$C$12=\"Autumn\",SUM($AC98:$AF98),IF(Header!$C$12=\"Spring\",SUM($AC98:$AE98),0)))*$I98","v":0},0,null,{"$f":"$D98*$F98*SUM(Header!$D$13:$D$15)","v":0},{"$f":"IF($G98>15,15,$G98)*$D98*Header!$D$16","v":0},{"$f":"IF($F98>15,15,$F98)*$D98*Header!$D$17","v":0},{"$f":"IF(Header!$C$12=\"Summer\",SUM($AH98:$AK98),IF(Header!$C$12=\"Autumn\",SUM($AG98:$AI98),IF(Header!$C$12=\"Spring\",SUM($AF98:$AJ98),0)))*$I98","v":0},0,null,{"$f":"$E98*$F98*SUM(Header!$E$13:$E$15)","v":0},{"$f":"IF($G98>15,15,$G98)*$E98*Header!$E$16","v":0},{"$f":"IF($F98>15,15,$F98)*$E98*Header!$E$17","v":0},{"$f":"IF(Header!$C$12=\"Summer\",SUM($AL98:$AN98),IF(Header!$C$12=\"Autumn\",SUM($AJ98:$AN98),IF(Header!$C$12=\"Spring\",SUM($AK98:$AN98),0)))*$I98","v":0},0,null,0,null,0]
[null,null,null,null,null,null,null,null,null,null,null,null,null,0,0,0,0,0,0,0,0,0,0,0,0,0,0,null,0,{"$f":"IF(AC99=1,IF(AC$7=$K99,0,1),IF(AD$7=$J99,1,0))","v":0},0,0,0,0,0,0,0,0,0,0,null,{"$f":"$C99*$F99*SUM(Header!$C$13:$C$15)","v":0},{"$f":"IF($G99>15,15,$G99)*$C99*Header!$C$16","v":0},{"$f":"IF($F99>15,15,$F99)*$C99*Header!$C$17","v":0},{"$f":"IF(Header!$C$12=\"Summer\",SUM($AC99:$AG99),IF(Header!$C$12=\"Autumn\",SUM($AC99:$AF99),IF(Header!$C$12=\"Spring\",SUM($AC99:$AE99),0)))*$I99","v":0},0,null,{"$f":"$D99*$F99*SUM(Header!$D$13:$D$15)","v":0},{"$f":"IF($G99>15,15,$G99)*$D99*Header!$D$16","v":0},{"$f":"IF($F99>15,15,$F99)*$D99*Header!$D$17","v":0},{"$f":"IF(Header!$C$12=\"Summer\",SUM($AH99:$AK99),IF(Header!$C$12=\"Autumn\",SUM($AG99:$AI99),IF(Header!$C$12=\"Spring\",SUM($AF99:$AJ99),0)))*$I99","v":0},0,null,{"$f":"$E99*$F99*SUM(Header!$E$13:$E$15)","v":0},{"$f":"IF($G99>15,15,$G99)*$E99*Header!$E$16","v":0},{"$f":"IF($F99>15,15,$F99)*$E99*Header!$E$17","v":0},{"$f":"IF(Header!$C$12=\"Summer\",SUM($AL99:$AN99),IF(Header!$C$12=\"Autumn\",SUM($AJ99:$AN99),IF(Header!$C$12=\"Spring\",SUM($AK99:$AN99),0)))*$I99","v":0},0,null,0,null,0]
[null,null,null,null,null,null,null,null,null,null,null,null,null,0,0,0,0,0,0,0,0,0,0,0,0,0,0,null,0,{"$f":"IF(AC100=1,IF(AC$7=$K100,0,1),IF(AD$7=$J100,1,0))","v":0},0,0,0,0,0,0,0,0,0,0,null,{"$f":"$C100*$F100*SUM(Header!$C$13:$C$15)","v":0},{"$f":"IF($G100>15,15,$G100)*$C100*Header!$C$16","v":0},{"$f":"IF($F100>15,15,$F100)*$C100*Header!$C$17","v":0},{"$f":"IF(Header!$C$12=\"Summer\",SUM($AC100:$AG100),IF(Header!$C$12=\"Autumn\",SUM($AC100:$AF100),IF(Header!$C$12=\"Spring\",SUM($AC100:$AE100),0)))*$I100","v":0},0,null,{"$f":"$D100*$F100*SUM(Header!$D$13:$D$15)","v":0},{"$f":"IF($G100>15,15,$G100)*$D100*Header!$D$16","v":0},{"$f":"IF($F100>15,15,$F100)*$D100*Header!$D$17","v":0},{"$f":"IF(Header!$C$12=\"Summer\",SUM($AH100:$AK100),IF(Header!$C$12=\"Autumn\",SUM($AG100:$AI100),IF(Header!$C$12=\"Spring\",SUM($AF100:$AJ100),0)))*$I100","v":0},0,null,{"$f":"$E100*$F100*SUM(Header!$E$13:$E$15)","v":0},{"$f":"IF($G100>15,15,$G100)*$E100*Header!$E$16","v":0},{"$f":"IF($F100>15,15,$F100)*$E100*Header!$E$17","v":0},{"$f":"IF(Header!$C$12=\"Summer\",SUM($AL100:$AN100),IF(Header!$C$12=\"Autumn\",SUM($AJ100:$AN100),IF(Header!$C$12=\"Spring\",SUM($AK100:$AN100),0)))*$I100","v":0},0,null,0,null,0]