{"text_format":"1","workbook":"xlsx","n_sheets":4,"sheets":["Guidance","BCM Criteria","Form","Lookup"],"not_rendered":{"charts":0,"images":0,"macros":1,"external_links":0,"defined_names":5,"comments":0,"pivot_tables":0},"unopened":[],"bounds":{"document_bytes":16777216,"sheet_cells":100000,"rows_first":2000,"rows_last":500,"rows_between":2000,"halvings":0,"cell_chars":16384,"cell_head_chars":4096},"cells_cut":0,"cells_raw":0,"read":"whole","date_system":"1900"}

{"sheet":"Guidance","index":0,"n_rows":57,"n_cols":4,"rows_kept":57,"cut":false,"hidden":false,"merged":[]}
[]
[null,"Guidance for the completion of the Analysis of Revenue Balances form."]
[]
[null,"THIS FORM SHOULD ONLY BE USED FOR YOUR YEAR END SUBMISSION TO SCHOOLS FINANCIAL SERVICES."]
[]
[null,"Instructions for completion."]
[]
[null,"Enter the last four digits of you DfE number in cell E1 (the green box), your school name will be displayed."]
[null,"In B (cell E6) the year end forecast you submitted as part of the Nine Months Monitoring return will pre-populate."]
[null,"In C (cell E7) the difference between your Nine Months Monitoring year end forecast and your Closedown year end position will be calculated."]
[null,"(This will always be the same as B until you complete A (cell E5))"]
[null,"In D (cell E13) your Budget Control Mechanism (BCM) limit based on your March Statement of Account (SoA) is displayed."]
[null,"The BCM is worked out by adding together your March SoA totals for CFR codes I01, I02, I03, I05 and I18."]
[null,"This total is then multiplied by the allowable threshold your school type attracts. All of this information is held in the background of this form."]
[]
[null,"Section 1"]
[]
[null,"From your Closedown FMS Reconciliation Report, enter the Actual Revenue Current Position figure into A (cell E5)"]
[null,"This will normally be Fund 01, but if you have multiple funds, you will need to add these together. Remember Revenue Only."]
[null,"If you have a surplus balance enter the figure with a leading minus. If you enter a positive figure, a prompt will tell you \"You are in Deficit\"."]
[null,"If you enter the figure in A (cell E5) with a leading minus, the box will turn red. At this stage this is expected, it means the form is not complete."]
[]
[null,"In C (cell E7) the difference between your Nine Months Monitoring year end forecast and your Closedown year end position is displayed."]
[]
[null,"If Row 8 turns green and Row 9 turns black, the difference between your Nine Months Monitoring forecast and your Closedown position is within limits."]
[null,"If they remain yellow and clear, you need to add a brief comment to explain the difference in Row 9."]
[]
[null,"Section 2"]
[]
[null,"There is no input required in this section as all cells are pre-populated."]
[]
[null,"Section 2.1 and Section 4 - Only applicable if you exceed your BCM limit"]
[]
[null,"J (cell E20) displays the balance of the amount over the BCM limit that has not been allocated across F to I."]
[null,"Please read the BCM guidance that explains the 4 allowable criteria and allocate the excess funds accordingly"]
[null,"A prompt box will appear to the right. An amber box indicates you have not allocated enough across F to I, a red box indicates you have allocated too much."]
[null,"When F to I equal the amount over BCM, there will be no amber or red box and J (cell E22) will be zero. This section is now balanced."]
[null,"D (cell E21) and A (cell E22) are populated from Section 1 & 2 above."]
[null,"Whichever rows you have used from (F to I), a prompt will appear to the right indicating which sections of Section 4 below need to be completed."]
[null,"Once the figures entered into Sections 4.1 to 4.4 equal the corresponding figures in F to I, the prompts will disappear."]
{"$rows_left_out":18}
{"sheet":"BCM Criteria","index":1,"n_rows":73,"n_cols":17,"rows_kept":73,"cut":false,"hidden":false,"merged":[[70,2,70,14],[72,2,72,14],[40,2,40,14],[42,2,42,14],[44,2,44,14],[52,2,52,14],[66,2,66,14],[68,2,68,14],[64,2,64,14],[62,2,62,14],[48,3,48,14],[50,3,50,14],[56,1,56,14],[60,2,60,14],[58,2,58,14],[38,2,38,14],[1,1,1,14],[2,1,2,14],[6,1,6,14],[8,1,8,14],[12,1,12,14]]}
[]
[null,"Schools Financial Services Guidance"]
[null,"Balance Control Mechanism (BCM) Criteria - Which category to use? "]
[]
[null,"Introduction"]
[]
[null,"The Schools’ Funding Forum fundamental principle underpinning the BCM is that the funding received for the period (financial year April to March), which is predicated on the cohort of pupils at the school during that period, should be spent on those pupils during that period.",null,null,null,null,null,null,null,null,null,null,null,null,null,null,"DD"]
[]
[null,"The allowable BCM Thresholds (12% - Primary, Special and PRU and 7.5% - Secondary) have been set to recognise the need of a financial tolerance, to enable an appropriate resource to ensure a smooth transition, when circumstances within the school change, for example a falling roll.",null,null,null,null,null,null,null,null,null,null,null,null,null,null,"DD"]
[]
[null,"BCM Allowable Criteria"]
[]
[null,"There are four accepted criteria that allow schools to carry forward funding in excess of their Balance Control Mechanism (BCM) into the next financial year: Capital Projects, Holding Funds on Behalf of Other Schools, Late Allocations and Other Grants & Payments.  Outlined below are details of each of the criteria to assist schools who are over their BCM limit in completing the 9 month and Year end returns. ",null,null,null,null,null,null,null,null,null,null,null,null,null,null,"DDD"]
[]
[null,"Capital Project. "]
[]
[null,"·","Schools can be over the BCM if they plan to make a revenue to capital contribution for a future capital project that is planned for the following year."]
[]
[null,"·","The returns information must include details of the capital project as well as the expected completion date"]
[]
[null,"·","The full cost of the project is required, as well as details of how much of the excess BCM will be used to fund the project"]
[]
[null,"·","Copy invoices will be required on completion of the project"]
[]
[null,"·","Examples: Extension to the school building"]
[]
[null,"Funds Held on Behalf of Other Schools. "]
[]
[null,"·","Schools can be over the BCM if they are holding funds on behalf of other schools "]
[]
[null,"·","The returns information must include details of what the funds are being used for"]
[]
[null,"·","The returns information must include the current balance of the held funds and the date by which they need to be spent"]
[]
[null,"·","Examples: Collaborative Funding with Partnership School"]
[]
[null,"Late Allocation."]
[]
[null,"·","A Late Allocation is funding that has been received in the latter part of the year that was not included within the original budget or included as additional income to the yearend forecast within the budget monitoring.",null,null,null,null,null,null,null,null,null,null,null,null,null,"DD"]
[]
{"$rows_left_out":34}
{"sheet":"Form","index":2,"n_rows":54,"n_cols":17,"rows_kept":54,"cut":false,"hidden":false,"merged":[[1,5,1,7],[23,0,23,1],[22,0,22,4],[24,0,24,1],[21,0,21,2],[15,7,18,9],[18,5,18,6],[15,0,15,2],[16,0,16,2],[17,0,17,2],[18,0,18,2],[20,0,20,2],[19,0,19,2],[14,0,14,4],[11,0,11,2],[10,0,10,2],[12,0,12,2],[13,0,13,2],[4,5,4,6],[27,7,27,9],[16,5,16,6],[15,5,15,6],[17,5,17,6],[27,5,27,6],[21,5,21,8],[0,2,0,3],[4,0,4,2],[2,0,2,4],[1,1,1,3],[8,0,8,4],[3,0,3,2],[6,0,6,2],[5,0,5,2],[7,0,7,4],[44,5,47,6],[49,0,49,1],[49,2,49,3],[29,0,29,4],[32,5,35,6],[30,0,30,4],[38,5,41,6],[33,2,33,3],[31,2,31,3],[35,2,35,3],[32,2,32,3],[34,2,34,3],[37,0,37,1],[37,2,37,3],[48,0,48,4],[47,2,47,3],[50,2,50,3],[50,5,53,6],[51,2,51,3],[52,2,52,3],[53,2,53,3],[42,0,42,4],[25,0,25,1],[46,2,46,3],[43,0,43,1],[43,2,43,3],[36,0,36,4],[39,2,39,3],[31,0,31,1],[45,2,45,3],[40,2,40,3],[44,2,44,3],[27,0,27,2],[26,0,26,1],[41,2,41,3],[38,2,38,3]]}
["Version March 2024","This form is to be used as part of the 2023-24 Year End returns only","DfE No:",null,null,{"$f":"VLOOKUP(E1,Lookup!A:D,4,0)","v":{"$error":"#N/A"}},null,{"$f":"IF(E1=0,0,1)","v":0},null,null,null,"DD","2024-03-31",{"$f":"DAY(M1)","v":31},{"$f":"MONTH(M1)","v":3},{"$f":"DATE(O3,O1,N1)","v":"2025-03-31"},{"$f":"DATE(N3,O2,N2)","v":"2024-04-01"}]
["School Name:",{"$f":"IFERROR(VLOOKUP(E1,Lookup!A:N,2,FALSE),\"\")","v":""},null,null,null,{"$f":"IF(Lookup!R7<>\"\",\"Links have not been removed\",\"\")","v":""},null,null,null,null,null,null,"2024-04-01",{"$f":"DAY(M2)","v":1},{"$f":"MONTH(M2)","v":4}]
["Analysis of Year End Revenue Balances",null,null,null,null,null,null,null,null,null,null,null,{"$f":"TODAY()","v":"2024-03-20"},{"$f":"YEAR(TODAY())","v":2024},{"$f":"YEAR(TODAY())+1","v":2025}]
["Section 1 - Total Revenue Rollover and comparison to Nine Month Forecast",null,null,"Row","Amount £ / pp"]
["Total Revenue Funds rollover c/f (Final Reconciliation Report, Actual Column, Current position)\nFor surplus balance enter as a negative (leading minus) / For year end deficit enter as a positive                                                                                           ",null,null,"A",null,{"$f":"IF(E5>0,\"You are showing a Year End Revenue Deficit\",\"\")","v":""},null,null,null,null,null,"DD"]
[{"$f":"IFERROR(\"Year end forecast figure as at nine month monitoring return\"&IF(OR(E1=\"\",E5=\"\"),\"\",IF(E6<0,\" was a surplus\",\" was a deficit\")),\"\")","v":"Year end forecast figure as at nine month monitoring return"},null,null,"B",{"$f":"IFERROR(ROUND(VLOOKUP(E1,Lookup!A:N,14,FALSE),2),\"\")","v":""},null,null,null,null,null,null,"DD"]
["Difference between nine months forecast and actual Year End figures",null,null,"C",{"$f":"IFERROR(ROUND((E5-E6),2),\"\")","v":""},null,null,null,null,null,null,"DD"]
[{"$f":"IF(E5=\"\",\"\",IFERROR(IF(VLOOKUP(E1,Lookup!A:Q,17,FALSE)=\"Within Tolerance\",\"The figure in Row C is less than £10,000 or 15% of the figure is Row A therefore NO explanation is required below\",\"The figure in Row C of £\"&IF(E7>0,TEXT(E7,\"#,##0.00\"),TEXT(-E7,\"#,##0.00\"))&\" is more than we would expect, please enter a brief description below to explain the reason.\"),\"\"))","v":""}]
[]
[]
["Section 2 - Budget Control Mechanism - Detailed breakdown of Revenue Rollover",null,null,"Row","Amount £ / pp",null,null,null,null,null,null,"DD"]
["Total Revenue Funds rollover c/f from Row A above",null,null,"A",{"$f":"E5","v":0},null,null,null,null,null,null,"DD"]
[{"$f":"IFERROR(IF(AND(E1>1100,E1<2000),\"Please enter your total income for 2023-24 in cell F13 highlighted in yellow, your BCM figure is 12% of your income\",(\"Allowable Balance Control Mechanism (BCM)  (March Statement of account totals for (I01+I02+I03+I05+I18) * \"&TEXT(VLOOKUP(E1,Lookup!A:E,5,FALSE),\"##.##%\")&\")\")),\"Allowable Balance Control Mechanism (BCM)\")","v":"Allowable Balance Control Mechanism (BCM)"},null,null,"D",{"$f":"IFERROR(IF(AND(E1>1100,E1<2000),F13*12%,ROUND(VLOOKUP(E1,Lookup!A:N,3,FALSE),2)),\"\")","v":""},null,null,null,null,null,null,"DD"]
[{"$f":"IF(E14>0,\"You have exceeded your allowable Balance Control Mechanism figure (BCM)\",\"You are within your allowable Balance Control Mechanism figure (BCM)\")","v":"You are within your allowable Balance Control Mechanism figure (BCM)"},null,null,"E",{"$f":"IFERROR(ROUND(IF(E5+E13>0,0,-(E5+E13)),2),0)","v":0},null,null,null,null,null,null,"DD"]
[{"$f":"IF(E14=0,\"Section 2.1 - This section is not applicable as you are not over your BCM allowable.\",\"Section 2.1  BCM breakdown - complete rows F to I (total must not be greater than the amount you are over your BCM by (\"&TEXT(ROUND(E14,2),\"£#,###.00\")&\"))\")","v":"Section 2.1 - This section is not applicable as you are not over your BCM allowable."},null,null,null,null,null,null,null,null,null,null,"DD"]
["Revenue contribution to Capital project (planned for NEW year)\nProvide detail below in section 4.1",null,null,"F",null,{"$f":"IF(AND(E16<>0,SUM(C33:C36)=0),\"Details are required in Section 4.1 BCM breakdown below\",\"\")","v":""},null,{"$f":"IFERROR(IF(ROUND((SUM(E16:E19)-E14),2)=0,\"\",IF(ROUND(E14-SUM(E16:E19),2)<0,\"The current total of Rows F to I is more than the amount over your BCM by \"&TEXT(ROUND((E14-SUM(E16:E19)),2),\"£#,###.00\")&CHAR(10)&CHAR(10)&\"You need to ensure that this total is equal to the amount over BCM (Row E).\",\"The current total of Rows F to I is less than the amount over your BCM by \"&TEXT(ROUND((E14-SUM(E16:E19)),2),\"£#,###.00\")&CHAR(10)&CHAR(10)&\"This amount may be subject to clawback (Row J).\")),\"\")","v":""},null,null,null,"DD"]
["Funding held on behalf of other schools\nProvide detail below in section 4.2",null,null,"G",null,{"$f":"IF(AND(E17<>0,SUM(C39:C42)=0),\"Details are required in Section 4.2 below\",\"\")","v":""},null,null,null,null,null,"DD"]
["Late allocations\nProvide detail below in section 4.3",null,null,"H",null,{"$f":"IF(AND(E18<>0,SUM(C45:C48)=0),\"Details are required in Section 4.3 below\",\"\")","v":""},null,null,null,null,null,"DD"]
["Other grant income and funding sources\nProvide detail below in section 4.4",null,null,"I",null,{"$f":"IF(AND(E19<>0,SUM(C50:C53)=0),\"Details are required in Section 4.4 below\",\"\")","v":""},null,null,null,null,null,"DD"]
["This amount over your BCM may be subject to Clawback.",null,null,"J",{"$f":"ROUND(SUM(E16:E19),2)","v":0},null,null,null,null,null,null,"DD"]
["Allowable Balance Control Mechanism (BCM) from Row D above",null,null,"D",{"$f":"ROUND(E13,2)","v":{"$error":"#VALUE!"}},null,null,null,null,null,null,"DD"]
["Total Revenue Funds in Section 2.1",null,null,"A",{"$f":"ROUND(SUM(E20:E21),2)","v":{"$error":"#VALUE!"}},{"$f":"IF(E14=0,\"\",IF(ROUND(SUM(E16:E19)+E21+E5,2)<0,\"You have \"&TEXT(ROUND((SUM(E16:E19)+E21+E5)*-1,2),\"£#,###.00\")&\" that may be subject to clawback\",IF(ROUND(SUM(E16:E19)+E21+E5,2)>0,\"You have allocated \"&TEXT(ROUND((E5+SUM(E16:E21)),2),\"£#,###.00\")&\" too much\",\"\")))","v":""},null,null,null,null,null,"DD"]
["Section 3 - Total Revenue Rollover breakdown - The DfE require this breakdown",null,null,null,null,null,null,null,null,null,null,"DD"]
["Total of breakdown of amount over BCM from above (Rows F to I above) (pre-populated)",null,"B01","J",{"$f":"ROUND(SUM(E16:E19),2)","v":0},null,null,null,null,null,null,"DD"]
["Community Focussed School Balance c/f figure - if applicable \n(from Section 3 of the Additional supporting information Closedown form)",null,"B06 c/f","K",0,null,null,null,null,null,null,"DD"]
["The remaining Committed element from Row A above.",null,"B01","L",null,null,null,null,null,null,null,"DD"]
["The Uncommitted element from Row A above\nIf the figure in row A is a deficit, enter the whole amount here with a leading minus",null,"B02","M",null,null,null,null,null,null,null,"DD"]
["Total of rows J to M - must match row A above",null,null,"N",{"$f":"ROUND(SUM(E24:E27),2)","v":0},{"$f":"IF(H1=0,\"\",IF(-E28=E5,\"CORRECT\",\"This amount must match Row A\"))","v":""},null,{"$f":"IF(E5+E28<0,\"You still have \"&TEXT(ROUND((E5+E28)*-1,2),\"£#,###.00\")&\" to allocate\",IF(E5+E28>0,\"You have allocated \"&TEXT(ROUND((E5+E28),2),\"£#,###.00\")&\" too much\",\"\"))","v":""},null,null,null,"DD"]
[]
[{"$f":"IF(E14=0,\"\",\"Section 4.1  BCM breakdown - The section below relates to Section 2.1 above\")","v":""}]
["Section 4.1                              Analysis of row F - brief description of Revenue contribution to Capital project (planned for NEW year)"]
["Evidence should be retained in the school",null,"Amount £/pp",null,"Date to be spent by"]
[1,null,null,null,null,{"$f":"IF(E16=SUM(C33:D36),\"\",\"The total in this section must equal the total of row F (\"&TEXT(ROUND(E16,2),\"£#,###.00\")&\")\")","v":""}]
[2]
[3]
[4]
["Section 4.2                              Analysis of row G - Funding held on behalf of other schools"]
["Evidence should be retained in the school",null,"Amount £/pp",null,"Date to be spent by"]
[1,null,null,null,null,{"$f":"IF(E17=SUM(C39:D42),\"\",\"The total in this section must equal the total of row G (\"&TEXT(ROUND(E17,2),\"£#,###.00\")&\")\")","v":""}]
[2]
{"$rows_left_out":15}
{"sheet":"Lookup","index":3,"n_rows":300,"n_cols":18,"rows_kept":300,"cut":false,"hidden":true,"merged":[[6,17,17,19],[0,5,0,9]]}
[null,null,null,null,null,"March 2023 Advance figures",null,null,null,null,"Kelsi / Invoice",null,"Year End","9 Months ",null,null,"Tolerance","Tolerance"]
["DfE","school name","BCM","Phase","%","I01-01 and -50","I02-01","I03-01","I05-01","I18-01","Rates","Total","Actual","YE Forecast","Variance","% var",10000,0.15]
[1001,"Northfleet Nursery School",{"$f":"IF(D3=1,L3*0.12,IF(D3=3,L3*0.085,L3*0.075))","v":72099.918000000005},1,{"$f":"IF(D3=1,0.12,IF(D3=4,0.085,0.075))","v":0.12},578719.52,0,22113.130000000005,0,0,0,{"$f":"SUM(F3:K3)","v":600832.65},{"$f":"Form!$E$5","v":0},-63828.690000000104,{"$f":"N3-M3","v":-63828.690000000104},{"$f":"O3/M3","v":{"$error":"#DIV/0!"}},{"$f":"IF(AND(O3<$Q$2,O3>-$Q$2),\"Within Tolerance\",IF(AND(P3<$R$2,P3>-$R$2),\"Within Tolerance\",O3))","v":{"$error":"#DIV/0!"}}]
[1123,"The Rosewood School",{"$f":"IF(D4=1,L4*0.12,IF(D4=3,L4*0.085,L4*0.075))","v":429268.5576},1,0.12,1558233.18,0,2019004.8,0,0,0,3577237.98,{"$f":"Form!$E$5","v":0},-422675.48899999959,{"$f":"N4-M4","v":-422675.48899999959},{"$f":"O4/M4","v":{"$error":"#DIV/0!"}},{"$f":"IF(AND(O4<$Q$2,O4>-$Q$2),\"Within Tolerance\",IF(AND(P4<$R$2,P4>-$R$2),\"Within Tolerance\",O4))","v":{"$error":"#DIV/0!"}}]
[1124,"Birchwood PRU",66869.32680000001,1,0.12,398766.40000000014,0,156877.99,1600,0,0,557244.39000000013,{"$f":"Form!$E$5","v":0},-118753.62999999984,-118753.62999999984,{"$error":"#DIV/0!"},{"$error":"#DIV/0!"}]
[1127,"Maidstone and Malling Alternative Provision",127635.98639999999,1,0.12,765268.72,0,295564.5,2800,0,0,1063633.22,{"$f":"Form!$E$5","v":0},-135739.35000000015,-135739.35000000015,{"$error":"#DIV/0!"},{"$error":"#DIV/0!"}]
[1128,"Thanet & Dover AC PRU",198922.19760000004,1,0.12,1184729.3000000003,0,469355.68000000011,3600,0,0,1657684.9800000004,{"$f":"Form!$E$5","v":0},-208579.98999999973,-208579.98999999973,{"$error":"#DIV/0!"},{"$error":"#DIV/0!"}]
[1129,"West Kent AC Pru (Ton, Tun Wells & Sev)",120777.53519999998,1,0.12,718071.83,0,288007.63,400,0,0,1006479.46,{"$f":"Form!$E$5","v":0},-403239.66000000038,-403239.66000000038,{"$error":"#DIV/0!"},{"$error":"#DIV/0!"}]
[2000,"St John's CE School",339699.02640000003,1,0.12,2303796.9500000002,0,126424.26999999999,316755,59273,24576,2830825.22,{"$f":"Form!$E$5","v":0},-14415.629999999721,-14415.629999999721,{"$error":"#DIV/0!"},{"$error":"#DIV/0!"}]
[2002,"Repton Manor",299869.93800000002,1,0.12,2137584.5700000003,0,136542.58000000002,138730,75409,10650,2498916.1500000004,{"$f":"Form!$E$5","v":0},-258930.44000000012,-258930.44000000012,{"$error":"#DIV/0!"},{"$error":"#DIV/0!"}]
[2065,"Discovery School, The",394498.91639999999,1,0.12,2792308,0,203809.97000000003,81035,135074,75264,3287490.97,{"$f":"Form!$E$5","v":0},-36693.690000000366,-36693.690000000366,{"$error":"#DIV/0!"},{"$error":"#DIV/0!"}]
[2079,"Woodlands Primary School ",403369.86719999992,1,0.12,2899890.8099999996,0,101995.75,189845,111828,57856,3361415.5599999996,{"$f":"Form!$E$5","v":0},-443657.84999999963,-443657.84999999963,{"$error":"#DIV/0!"},{"$error":"#DIV/0!"}]
[2088,"Crockenhill Primary School",142011.6372,1,0.12,1012288.05,0,22187.260000000006,87995,37133,23827,1183430.31,{"$f":"Form!$E$5","v":0},-65319.06999999973,-65319.06999999973,{"$error":"#DIV/0!"},{"$error":"#DIV/0!"}]
[2089,"Anthony Roper Primary School, The",181667.32679999998,1,0.12,1378228,0,4608.3899999999994,53770,70632,6656,1513894.39,{"$f":"Form!$E$5","v":0},-121098.42999999985,-121098.42999999985,{"$error":"#DIV/0!"},{"$error":"#DIV/0!"}]
[2094,"Cobham Primary School",134378.84040000002,1,0.12,988117.74000000011,0,35661.930000000008,35550,43278,17216,1119823.6700000002,{"$f":"Form!$E$5","v":0},-81819.820000000211,-81819.820000000211,{"$error":"#DIV/0!"},{"$error":"#DIV/0!"}]
[2095,"Cecil Road Primary and Nursery School",279388.59120000002,1,0.12,1984426.0100000002,0,147647.24999999997,91305,70812,34048,2328238.2600000002,{"$f":"Form!$E$5","v":0},-16191.160000000615,-16191.160000000615,{"$error":"#DIV/0!"},{"$error":"#DIV/0!"}]
[2109,"Higham Primary School",137536.992,1,0.12,957694.55999999994,0,58021.04,51175,56921,22330,1146141.6000000001,{"$f":"Form!$E$5","v":0},-49918.709999999875,-49918.709999999875,{"$error":"#DIV/0!"},{"$error":"#DIV/0!"}]
[2116,"Lawn Primary School",181207.19639999996,1,0.12,1253690.3499999996,0,41657.619999999995,158340,35663,20709,1510059.9699999997,{"$f":"Form!$E$5","v":0},-19633.180000000648,-19633.180000000648,{"$error":"#DIV/0!"},{"$error":"#DIV/0!"}]
[2120,"Bean Primary School",131334.29999999996,1,0.12,932391.10999999975,0,46103.889999999992,56745,42496,16716.5,1094452.4999999998,{"$f":"Form!$E$5","v":0},-68754.380000000107,-68754.380000000107,{"$error":"#DIV/0!"},{"$error":"#DIV/0!"}]
[2128,"Capel Primary School",133134.22319999998,1,0.12,945828.39,0,42120.22,49470,48206,23827.25,1109451.8599999999,{"$f":"Form!$E$5","v":0},-132892.47999999957,-132892.47999999957,{"$error":"#DIV/0!"},{"$error":"#DIV/0!"}]
[2130,"Dunton Green Primary School",137784.09360000002,1,0.12,945276.02000000025,0,44531.76,87635,46182,24576,1148200.7800000003,{"$f":"Form!$E$5","v":0},-89716.790000000328,-89716.790000000328,{"$error":"#DIV/0!"},{"$error":"#DIV/0!"}]
[2132,"Hadlow Primary School",146949.10560000001,1,0.12,970463.77000000014,0,90842.11,102545,36399,24326,1224575.8800000001,{"$f":"Form!$E$5","v":0},-123596.98999999987,-123596.98999999987,{"$error":"#DIV/0!"},{"$error":"#DIV/0!"}]
[2136,"Kemsing Primary School",121888.06200000003,1,0.12,870132.40000000037,0,40617.450000000012,33465,49563,21956,1015733.8500000003,{"$f":"Form!$E$5","v":0},-26305.990000000114,-26305.990000000114,{"$error":"#DIV/0!"},{"$error":"#DIV/0!"}]
[2137,"Leigh Primary School",120144.28080000001,1,0.12,814549.53,0,76142.81,52695,46962,10853,1001202.3400000001,{"$f":"Form!$E$5","v":0},-9132.6400000002905,-9132.6400000002905,{"$error":"#DIV/0!"},"Within Tolerance"]
[2138,"Otford Primary School",209434.75440000003,1,0.12,1544179.5200000003,0,36241.1,65095,70334,29440,1745289.6200000003,{"$f":"Form!$E$5","v":0},-197670,-197670,{"$error":"#DIV/0!"},{"$error":"#DIV/0!"}]
[2139,"Pembury School",245455.49280000004,1,0.12,1810428.0000000005,0,41465.799999999996,70585.64,80487,42496,2045462.4400000004,{"$f":"Form!$E$5","v":0},-186215.59999999995,-186215.59999999995,{"$error":"#DIV/0!"},{"$error":"#DIV/0!"}]
[2142,"Sandhurst Primary School",114602.25479999998,1,0.12,769615.7699999999,0,67890.50999999998,52380,39644,25488.51,955018.78999999992,{"$f":"Form!$E$5","v":0},-79751.149999999776,-79751.149999999776,{"$error":"#DIV/0!"},{"$error":"#DIV/0!"}]
[2147,"Weald Community Primary School",88404.623999999996,1,0.12,643651.5,0,19794.7,20370,37669,15220,736705.2,{"$f":"Form!$E$5","v":0},-75719.919999999678,-75719.919999999678,{"$error":"#DIV/0!"},{"$error":"#DIV/0!"}]
[2148,"Shoreham Village School",78472.727999999988,1,0.12,557110.25999999989,0,21302.880000000001,32010,27305,16211.26,653939.39999999991,{"$f":"Form!$E$5","v":0},-34982.969999999914,-34982.969999999914,{"$error":"#DIV/0!"},{"$error":"#DIV/0!"}]
[2155,"Slade Primary School ",305090.5356,1,0.12,1995193.7800000005,0,345748.35000000003,90480,81047,29952,2542421.1300000004,{"$f":"Form!$E$5","v":0},-70561.12999999887,-70561.12999999887,{"$error":"#DIV/0!"},{"$error":"#DIV/0!"}]
[2156,"Sussex Road Community Primary School",263037.56519999995,1,0.12,1909319.8999999997,0,55036.91,91575,78116,57931.9,2191979.7099999995,{"$f":"Form!$E$5","v":0},-263209.05999999971,-263209.05999999971,{"$error":"#DIV/0!"},{"$error":"#DIV/0!"}]
[2161,"Boughton Monchelsea Primary School",162403.33319999999,1,0.12,1028178.56,0,192247.55000000002,60350,50005,22580,1353361.11,{"$f":"Form!$E$5","v":0},-114206.66999999942,-114206.66999999942,{"$error":"#DIV/0!"},{"$error":"#DIV/0!"}]
[2163,"East Farleigh Primary School",153806.40239999996,1,0.12,1017474.4599999998,0,151683.56,46875,48970,16717,1281720.0199999998,{"$f":"Form!$E$5","v":0},-76197.110000000073,-76197.110000000073,{"$error":"#DIV/0!"},{"$error":"#DIV/0!"}]
[2164,"East Peckham Primary School",119525.26800000001,1,0.12,826874.62000000011,0,56959.280000000006,39285,52216,20709,996043.90000000014,{"$f":"Form!$E$5","v":0},-55661.200000000274,-55661.200000000274,{"$error":"#DIV/0!"},{"$error":"#DIV/0!"}]
[2165,"Headcorn Primary School",257115.96359999996,1,0.12,1791399.6699999997,0,95847.360000000001,116195,85431,53760,2142633.0299999998,{"$f":"Form!$E$5","v":0},-152580.43999999939,-152580.43999999939,{"$error":"#DIV/0!"},{"$error":"#DIV/0!"}]
[2166,"Hollingbourne Primary School",88993.127999999982,1,0.12,591301.79999999993,0,67240.599999999991,38525,30819,13723,741609.39999999991,{"$f":"Form!$E$5","v":0},-39628.979999999785,-39628.979999999785,{"$error":"#DIV/0!"},{"$error":"#DIV/0!"}]
[2167,"Ightham Primary School",135074.39880000002,1,0.12,958519.28000000026,0,67069.710000000021,20305,58269,21457,1125619.9900000002,{"$f":"Form!$E$5","v":0},-38743.400000000373,-38743.400000000373,{"$error":"#DIV/0!"},{"$error":"#DIV/0!"}]
[2168,"Lenham Primary School",144849.43439999997,1,0.12,1000252.4399999998,0,58142.18,69775,60072,18837,1207078.6199999999,{"$f":"Form!$E$5","v":0},-134607.2199999993,-134607.2199999993,{"$error":"#DIV/0!"},{"$error":"#DIV/0!"}]
[2169,"Platts Heath Primary School",65127.842400000001,1,0.12,438084.39,0,54218.630000000005,28650,19434,2345,542732.02,{"$f":"Form!$E$5","v":0},-111190.00000000015,-111190.00000000015,{"$error":"#DIV/0!"},{"$error":"#DIV/0!"}]
[2171,"Brunswick House Primary School",306802.27560000005,1,0.12,1974526.4000000001,0,278207.23000000004,166315,63397,74240,2556685.6300000004,{"$f":"Form!$E$5","v":0},-284217.2199999991,-284217.2199999991,{"$error":"#DIV/0!"},{"$error":"#DIV/0!"}]
{"$rows_left_out":260}